program: Orca
programVersion: 5.0.2
elementType: O O N N C C C C C C C C C C C C C C C C C C C C C C H H H H H H H H H H H H H H H H H H H H H H H H H H H H
charge: 0
multiplicity: 1
keywords: wb97x-d3
keywords: def2-TZVPP
keywords: def2/J RIJCOSX
keywords: DEFGRID2
keywords: scfconv7
keywords: smallprint printgap noloewdin
keywords: NOSOSCF
formula: C22H28N2O2
InChI: InChI=1/C22H28N2O2/c1-7-17-8-10-18(11-9-17)20(25)23-24(22(4,5)6)21(26)19-13-15(2)12-16(3)14-19/h8-14,23H,7H2,1-6H3
54 atoms
O  -3.548095 -1.563279 0.420958
O  -0.901104 0.797442 -2.075019
N  -2.404165 0.391764 0.206442
N  -1.148977 0.924434 0.172224
C  -3.592119 1.266389 -0.01585
C  -4.515194 1.201868 1.204481
C  -3.12585 2.71093 -0.186732
C  -4.33123 0.839289 -1.285447
C  -2.499401 -0.965104 0.390688
C  -1.191118 -1.670912 0.612072
C  -0.41942 0.985813 -0.981507
C  -0.770804 -1.913064 1.914002
C  -0.438593 -2.12864 -0.458132
C  1.017305 1.317742 -0.774977
C  0.413042 -2.599398 2.158106
C  0.753984 -2.811083 -0.238879
C  1.163333 -3.035658 1.070157
C  1.664293 2.108967 -1.718709
C  1.745125 0.80947 0.297444
C  3.737606 1.93162 -0.488644
C  0.881031 -2.844798 3.563745
C  1.583672 -3.268759 -1.402182
C  3.00351 2.420015 -1.567186
C  3.090423 1.113065 0.431218
C  5.204786 2.229512 -0.357357
C  6.066226 1.178505 -1.055834
H  -5.351848 1.888024 1.064843
H  -4.924331 0.207246 1.360072
H  -3.988126 1.506344 2.110816
H  -4.009129 3.338053 -0.310072
H  -2.505931 2.846928 -1.071852
H  -2.584605 3.085573 0.682752
H  -5.146564 1.537197 -1.484156
H  -3.655555 0.850685 -2.139816
H  -4.760187 -0.155357 -1.193854
H  -0.722636 1.172099 1.050438
H  -1.378908 -1.57876 2.747549
H  -0.773513 -1.944853 -1.472076
H  2.088278 -3.573603 1.248468
H  1.110071 2.483868 -2.569101
H  1.28187 0.136193 1.009838
H  1.457145 -1.998326 3.943712
H  0.043336 -2.996513 4.243905
H  1.520642 -3.724529 3.625581
H  2.008991 -2.415421 -1.933709
H  2.408681 -3.905081 -1.08402
H  0.986206 -3.831269 -2.120269
H  3.489952 3.052723 -2.300448
H  3.64734 0.70143 1.264732
H  5.41938 3.214472 -0.778155
H  5.477962 2.281628 0.699071
H  5.89657 0.18746 -0.63419
H  7.126823 1.409486 -0.952826
H  5.836047 1.125635 -2.120012
totalener: -1115.27333617 hartree
nucrepener: 2411.33239381 hartree
electener: -3526.60572998 hartree
oneelecener: -6306.40667823 hartree
twoeener: 2779.80094825 hartree
kineticenergy: 1110.24827307 hartree
xcener: -110.506076013705 hartree
chargesum: -0.0000000
charge: -0.381128 -0.367688 -0.033416 -0.075904 0.156773 -0.294937 -0.273136 -0.314231 0.321894 0.113050 0.243191 -0.207286 -0.187388 0.062434 -0.008861 -0.014464 -0.133910 -0.177163 -0.204519 0.043849 -0.224946 -0.217935 -0.123995 -0.153052 -0.109335 -0.232744 0.084803 0.122113 0.078314 0.091129 0.110358 0.087795 0.081704 0.109276 0.114326 0.158056 0.102395 0.125011 0.088563 0.129672 0.130056 0.094721 0.093741 0.087929 0.102957 0.076577 0.102249 0.115679 0.112407 0.073082 0.072396 0.080228 0.086996 0.082313
qa: -0.3811 -0.3677 -0.0334 -0.0759 0.1568 -0.2949 -0.2731 -0.3142 0.3219 0.1131 0.2432 -0.2073 -0.1874 0.0624 -0.0089 -0.0145 -0.1339 -0.1772 -0.2045 0.0438 -0.2249 -0.2179 -0.1240 -0.1531 -0.1093 -0.2327 0.0848 0.1221 0.0783 0.0911 0.1104 0.0878 0.0817 0.1093 0.1143 0.1581 0.1024 0.1250 0.0886 0.1297 0.1301 0.0947 0.0937 0.0879 0.1030 0.0766 0.1022 0.1157 0.1124 0.0731 0.0724 0.0802 0.0870 0.0823
va: 2.1220 2.1221 2.9783 3.1066 3.9039 3.8997 3.9013 3.9008 4.1325 3.6779 4.2197 3.9774 3.9640 3.5231 3.7756 3.8018 3.9545 4.0789 3.9794 3.7577 3.9130 3.9154 3.9437 4.0475 3.8946 3.9153 1.0083 1.0230 1.0104 1.0106 1.0108 1.0095 1.0057 1.0179 1.0216 1.0294 1.0213 1.0264 1.0156 1.0224 1.0103 0.9923 1.0031 1.0050 0.9941 1.0077 1.0000 1.0074 1.0098 1.0066 1.0062 1.0053 1.0076 1.0053
dispcorr: -0.030640285 hartree
energy: -1115.303976457428
dipole: 9.10657 -7.17857 1.92800 4.77182 -3.80695 0.96488 3.05292 -2.08000 0.97292
magnitude: 2.36533 au
magnitude: 6.01218 debye
