program: Orca
programVersion: 5.0.2
elementType: O O O N N C C C C C C C C C C C C C C C C C C C C C C H H H H H H H H H H H H H H H H H H H H H H H H H H H H
charge: 0
multiplicity: 1
keywords: wb97x-d3
keywords: def2-TZVPP
keywords: def2/J RIJCOSX
keywords: DEFGRID2
keywords: scfconv7
keywords: smallprint printgap noloewdin
keywords: NOSOSCF
formula: C22H28N2O3
InChI: InChI=1/C22H28N2O3/c1-14-11-15(2)13-17(12-14)21(26)24(22(4,5)6)23-20(25)18-9-8-10-19(27-7)16(18)3/h8-13,23H,1-7H3
55 atoms
O  -3.696603 -1.142366 0.289889
O  -0.542237 0.796551 1.85342
O  4.564554 0.350538 0.568901
N  -2.382081 0.649498 -0.1661
N  -1.085239 1.047094 -0.324154
C  -3.440233 1.695091 0.003573
C  -4.535968 1.48192 -1.040629
C  -2.815817 3.068013 -0.234257
C  -4.013715 1.667923 1.420946
C  -2.607868 -0.684923 -0.021812
C  -1.451155 -1.605701 -0.251135
C  -0.21813 1.077531 0.711278
C  -1.129999 -2.503927 0.75654
C  -0.746993 -1.620657 -1.451983
C  1.16021 1.485142 0.309853
C  -0.077622 -3.402149 0.592147
C  0.293427 -2.519694 -1.645092
C  2.261852 0.692379 0.630741
C  0.61992 -3.394302 -0.609613
C  1.305348 2.690762 -0.380466
C  3.531125 1.154577 0.239747
C  0.320109 -4.317098 1.710827
C  1.044619 -2.556279 -2.94229
C  2.16796 -0.632887 1.328552
C  2.564603 3.120701 -0.746748
C  3.682467 2.356071 -0.441685
C  5.871385 0.725231 0.175908
H  -5.074257 0.546473 -0.906936
H  -4.121731 1.499498 -2.049733
H  -5.264699 2.290023 -0.967449
H  -2.369945 3.161094 -1.225148
H  -2.064323 3.323201 0.513194
H  -3.608628 3.812715 -0.163311
H  -3.225322 1.780729 2.165256
H  -4.561652 0.754139 1.637891
H  -4.70665 2.501413 1.54239
H  -0.762906 1.226631 -1.264862
H  -1.681992 -2.490876 1.689402
H  -1.009489 -0.93615 -2.250615
H  1.445131 -4.085121 -0.745188
H  0.437594 3.295953 -0.610296
H  1.003897 -5.093233 1.369715
H  0.823945 -3.760557 2.504133
H  -0.545978 -4.802537 2.161125
H  0.622667 -3.301737 -3.619408
H  1.006898 -1.595104 -3.453725
H  2.091364 -2.81753 -2.788628
H  2.683508 -1.408431 0.761073
H  2.635796 -0.59521 2.314377
H  1.144937 -0.965729 1.468056
H  2.687492 4.057404 -1.273578
H  4.658998 2.70992 -0.742534
H  6.178896 1.672341 0.625628
H  5.965403 0.799036 -0.910226
H  6.535162 -0.059751 0.530546
elementType: O N C H
totalener: -1190.51070551 hartree
nucrepener: 2623.70711375 hartree
electener: -3814.21781926 hartree
oneelecener: -6835.54290171 hartree
twoeener: 3021.32508246 hartree
cpcmener: -0.05349903 hartree
kineticenergy: 1185.17901216 hartree
xcener: -116.620795777986 hartree
chargesum: -0.0000000
charge: -0.527353 -0.514075 -0.335215 -0.038482 -0.078888 0.215489 -0.319371 -0.320836 -0.344296 0.422152 0.108639 0.382824 -0.234434 -0.249269 0.122931 -0.045263 0.025109 -0.195791 -0.174534 -0.239707 0.336887 -0.219823 -0.226424 -0.305486 -0.179712 -0.222527 -0.129033 0.105772 0.102765 0.103219 0.111413 0.107760 0.113011 0.100608 0.104253 0.105792 0.205201 0.125801 0.133608 0.125135 0.163649 0.094826 0.102557 0.105767 0.107263 0.096735 0.098373 0.100862 0.122888 0.096607 0.160036 0.145204 0.113262 0.113037 0.121081
qa: -0.5274 -0.5141 -0.3352 -0.0385 -0.0789 0.2155 -0.3194 -0.3208 -0.3443 0.4222 0.1086 0.3828 -0.2344 -0.2493 0.1229 -0.0453 0.0251 -0.1958 -0.1745 -0.2397 0.3369 -0.2198 -0.2264 -0.3055 -0.1797 -0.2225 -0.1290 0.1058 0.1028 0.1032 0.1114 0.1078 0.1130 0.1006 0.1043 0.1058 0.2052 0.1258 0.1336 0.1251 0.1636 0.0948 0.1026 0.1058 0.1073 0.0967 0.0984 0.1009 0.1229 0.0966 0.1600 0.1452 0.1133 0.1130 0.1211
va: 1.9686 1.9771 2.0692 3.0310 3.1425 3.7989 3.8948 3.9043 3.9113 4.0410 3.5021 4.0540 3.9719 3.9417 3.4448 3.7611 3.6934 3.8237 3.8547 3.9627 3.7608 3.9013 3.9050 3.9781 3.9774 3.8824 3.8746 1.0203 1.0065 1.0041 1.0015 1.0005 1.0074 1.0139 1.0222 1.0032 0.9886 1.0256 1.0159 1.0070 0.9948 1.0044 0.9931 0.9979 0.9931 1.0018 1.0000 0.9961 1.0011 1.0008 0.9940 1.0071 0.9853 0.9862 0.9936
dispcorr: -0.032840212 hartree
energy: -1190.543545722662
dipole: 0.63525 2.27662 2.91187 1.35691 0.32328 1.68019 -4.14917 1.40452 -2.74465
magnitude: 4.33995 au
magnitude: 11.03127 debye
