program: Orca
programVersion: 5.0.2
elementType: O O O N N C C C C C C C C C C C C C C C C C C C C C C H H H H H H H H H H H H H H H H H H H H H H H H H H H H
charge: 0
multiplicity: 1
keywords: wb97x-d3
keywords: def2-TZVPP
keywords: def2/J RIJCOSX
keywords: DEFGRID2
keywords: scfconv7
keywords: smallprint printgap noloewdin
keywords: NOSOSCF
formula: C22H28N2O3
InChI: InChI=1/C22H28N2O3/c1-14-11-15(2)13-17(12-14)21(26)24(22(4,5)6)23-20(25)18-9-8-10-19(27-7)16(18)3/h8-13,23H,1-7H3
55 atoms
O  -3.683837 -1.128258 0.325559
O  -0.523345 0.796978 1.856032
O  4.581362 0.390879 0.5971
N  -2.370561 0.654008 -0.163778
N  -1.073798 1.052841 -0.320277
C  -3.432363 1.696883 -0.002296
C  -4.531712 1.460913 -1.037811
C  -2.818439 3.069901 -0.266305
C  -3.999305 1.689563 1.418311
C  -2.599068 -0.680398 -0.000339
C  -1.448629 -1.609299 -0.23903
C  -0.204475 1.083087 0.71763
C  -1.123335 -2.511112 0.763707
C  -0.762196 -1.636064 -1.450151
C  1.173063 1.5014 0.317603
C  -0.085324 -3.423611 0.58478
C  0.263631 -2.548311 -1.658701
C  2.277468 0.711892 0.636219
C  0.594909 -3.425559 -0.626799
C  1.316322 2.71477 -0.358755
C  3.547738 1.186133 0.262257
C  0.309377 -4.349859 1.695651
C  0.988873 -2.603301 -2.970236
C  2.182478 -0.617201 1.325912
C  2.575364 3.155588 -0.713174
C  3.695417 2.394745 -0.408181
C  5.884743 0.751095 0.187702
H  -5.056212 0.51918 -0.893678
H  -4.122813 1.47478 -2.049831
H  -5.271708 2.259869 -0.96945
H  -2.378686 3.150516 -1.261315
H  -2.06623 3.34492 0.473269
H  -3.615413 3.81173 -0.205762
H  -3.208121 1.811775 2.158508
H  -4.545838 0.778626 1.650142
H  -4.691728 2.525208 1.534116
H  -0.747604 1.222841 -1.260859
H  -1.663471 -2.491915 1.703506
H  -1.031655 -0.951392 -2.246725
H  1.406859 -4.129832 -0.775162
H  0.447808 3.320183 -0.585243
H  0.996231 -5.121997 1.350599
H  0.807421 -3.80316 2.499608
H  -0.557865 -4.843758 2.135581
H  0.570537 -3.375704 -3.619331
H  0.9206 -1.657201 -3.506659
H  2.045085 -2.836937 -2.8341
H  2.773832 -1.370796 0.805837
H  2.564637 -0.56241 2.347376
H  1.165272 -0.989227 1.382214
H  2.69622 4.099225 -1.228701
H  4.672063 2.75891 -0.696918
H  6.208626 1.698511 0.626762
H  5.969713 0.815159 -0.900535
H  6.546244 -0.036896 0.541468
elementType: O N C H
totalener: -1190.52116382 hartree
nucrepener: 2618.96311735 hartree
electener: -3809.48428117 hartree
oneelecener: -6825.90255952 hartree
twoeener: 3016.41827834 hartree
cpcmener: -0.04213920 hartree
kineticenergy: 1185.17078903 hartree
xcener: -116.615865921004 hartree
chargesum: 0.0000000
charge: -0.490462 -0.472663 -0.322688 -0.037799 -0.088985 0.214676 -0.318613 -0.321015 -0.340977 0.393877 0.102182 0.355752 -0.206565 -0.242496 0.119437 -0.054267 0.018026 -0.182193 -0.163165 -0.240513 0.327546 -0.221896 -0.227131 -0.293976 -0.179421 -0.221844 -0.131466 0.109223 0.098906 0.100893 0.107674 0.107751 0.111102 0.100917 0.105847 0.102064 0.197817 0.122446 0.129016 0.121374 0.160493 0.092369 0.102700 0.105677 0.107100 0.093921 0.097864 0.099705 0.121593 0.089876 0.156039 0.141539 0.111097 0.111594 0.120041
qa: -0.4905 -0.4727 -0.3227 -0.0378 -0.0890 0.2147 -0.3186 -0.3210 -0.3410 0.3939 0.1022 0.3558 -0.2066 -0.2425 0.1194 -0.0543 0.0180 -0.1822 -0.1632 -0.2405 0.3275 -0.2219 -0.2271 -0.2940 -0.1794 -0.2218 -0.1315 0.1092 0.0989 0.1009 0.1077 0.1078 0.1111 0.1009 0.1058 0.1021 0.1978 0.1224 0.1290 0.1214 0.1605 0.0924 0.1027 0.1057 0.1071 0.0939 0.0979 0.0997 0.1216 0.0899 0.1560 0.1415 0.1111 0.1116 0.1200
va: 2.0148 2.0311 2.0824 3.0161 3.1292 3.8070 3.8919 3.9058 3.9098 4.0759 3.5196 4.0867 3.9619 3.9398 3.4518 3.7710 3.7174 3.8307 3.8655 3.9641 3.7746 3.9033 3.9068 3.9745 3.9881 3.8856 3.8804 1.0207 1.0070 1.0045 1.0022 1.0002 1.0083 1.0138 1.0225 1.0034 0.9938 1.0262 1.0166 1.0075 0.9957 1.0048 0.9930 0.9977 0.9928 1.0027 0.9996 1.0002 1.0008 1.0020 0.9955 1.0079 0.9847 0.9864 0.9942
dispcorr: -0.032610915 hartree
energy: -1190.553774730461
dipole: 0.46319 2.25820 2.72138 1.17079 0.30327 1.47406 -4.40309 1.88565 -2.51743
magnitude: 3.98952 au
magnitude: 10.14055 debye
