program: Orca
programVersion: 5.0.2
elementType: Cl O O N N C C C C C C C C C C C C C C C C C C H H H H H H H H H H H H H H H H H H H
charge: 0
multiplicity: 1
keywords: wb97x-d3
keywords: def2-TZVPP
keywords: def2/J RIJCOSX
keywords: DEFGRID2
keywords: scfconv7
keywords: smallprint printgap noloewdin
keywords: NOSOSCF
formula: C18H19ClN2O2
InChI: InChI=1/C18H19ClN2O2/c1-18(2,3)21(17(23)14-7-5-4-6-8-14)20-16(22)13-9-11-15(19)12-10-13/h4-12,20H,1-3H3
42 atoms
Cl 5.727679 0.767982 -0.604079
O  -3.865041 -0.850157 0.514621
O  -0.518074 0.633082 1.825754
N  -2.28531 0.592005 -0.254077
N  -0.933548 0.742565 -0.393071
C  -3.14308 1.819765 -0.274536
C  -3.624154 2.173143 1.132319
C  -2.31469 2.983806 -0.812591
C  -4.32182 1.604004 -1.222309
C  -2.723844 -0.636525 0.138733
C  -1.730637 -1.755423 0.086837
C  -0.110744 0.731864 0.679583
C  1.336936 0.788062 0.347592
C  -1.487013 -2.472594 1.253178
C  -1.09478 -2.122278 -1.095849
C  -0.581692 -3.524042 1.245864
C  -0.206996 -3.186795 -1.103996
C  1.828396 1.548789 -0.709344
C  2.218577 0.042128 1.124671
C  0.060469 -3.881568 0.068608
C  3.182744 1.555118 -0.999612
C  3.571781 0.029635 0.834886
C  4.040242 0.786627 -0.228605
H  -4.179742 3.111299 1.096697
H  -4.284364 1.417922 1.552742
H  -2.784137 2.313624 1.812198
H  -1.911745 2.783559 -1.806131
H  -1.492987 3.258906 -0.151755
H  -2.96931 3.851337 -0.895222
H  -4.90427 2.524231 -1.279338
H  -3.974663 1.369392 -2.229476
H  -4.995102 0.814813 -0.898444
H  -0.559013 0.696741 -1.330343
H  -1.986103 -2.197903 2.173765
H  -1.291919 -1.582948 -2.014267
H  -0.379718 -4.064303 2.161147
H  0.281045 -3.470478 -2.026927
H  1.167271 2.160465 -1.310093
H  1.8517 -0.553485 1.950021
H  0.765892 -4.702054 0.063206
H  3.558964 2.153916 -1.81732
H  4.249049 -0.567607 1.429363
elementType: Cl O N C H
totalener: -1417.62440860 hartree
nucrepener: 2068.57112601 hartree
electener: -3486.19553461 hartree
oneelecener: -6047.65384635 hartree
twoeener: 2561.45831174 hartree
cpcmener: -0.04910828 hartree
kineticenergy: 1412.76839094 hartree
xcener: -114.612056945609 hartree
chargesum: 0.0000000
charge: -0.085782 -0.522068 -0.516300 -0.060661 -0.073983 0.214113 -0.342887 -0.313018 -0.314394 0.473082 0.021534 0.426479 0.048272 -0.199385 -0.190985 -0.201203 -0.178823 -0.195254 -0.219875 -0.118773 -0.154796 -0.145174 0.116643 0.106003 0.103795 0.101810 0.111388 0.105872 0.108898 0.102551 0.101767 0.106422 0.202945 0.147826 0.152965 0.159598 0.160759 0.157382 0.145638 0.162956 0.146724 0.147938
qa: -0.0858 -0.5221 -0.5163 -0.0607 -0.0740 0.2141 -0.3429 -0.3130 -0.3144 0.4731 0.0215 0.4265 0.0483 -0.1994 -0.1910 -0.2012 -0.1788 -0.1953 -0.2199 -0.1188 -0.1548 -0.1452 0.1166 0.1060 0.1038 0.1018 0.1114 0.1059 0.1089 0.1026 0.1018 0.1064 0.2029 0.1478 0.1530 0.1596 0.1608 0.1574 0.1456 0.1630 0.1467 0.1479
va: 1.2194 1.9707 1.9831 3.0451 3.1629 3.8170 3.9162 3.9020 3.8854 3.9784 3.5412 4.0634 3.4975 3.9799 3.9234 3.9323 3.9182 4.0128 4.0331 3.8593 4.0154 4.0026 3.8424 1.0040 1.0208 1.0128 1.0031 1.0033 1.0064 1.0043 1.0069 1.0217 0.9903 1.0159 1.0068 0.9926 0.9915 0.9998 1.0190 0.9882 1.0066 1.0051
dispcorr: -0.024212731 hartree
energy: -1417.648621335102
dipole: -30.26357 31.86512 1.60155 7.23496 -6.25249 0.98247 -2.91046 0.38397 -2.52649
magnitude: 3.14855 au
magnitude: 8.00298 debye
