program: Orca
programVersion: 5.0.2
elementType: Cl O O N N C C C C C C C C C C C C C C C C C C H H H H H H H H H H H H H H H H H H H
charge: 0
multiplicity: 1
keywords: wb97x-d3
keywords: def2-TZVPP
keywords: def2/J RIJCOSX
keywords: DEFGRID2
keywords: scfconv7
keywords: smallprint printgap noloewdin
keywords: NOSOSCF
formula: C18H19ClN2O2
InChI: InChI=1/C18H19ClN2O2/c1-18(2,3)21(17(23)14-7-5-4-6-8-14)20-16(22)13-9-11-15(19)12-10-13/h4-12,20H,1-3H3
42 atoms
Cl 5.787379 1.051205 -0.212859
O  -3.880385 -0.833531 0.383046
O  -0.590837 0.640516 1.775362
N  -2.243674 0.533741 -0.400048
N  -0.885386 0.666841 -0.465668
C  -3.087958 1.760064 -0.548929
C  -4.218504 1.479037 -1.539449
C  -3.636289 2.21625 0.802767
C  -2.228002 2.881015 -1.129389
C  -2.725495 -0.666177 0.03676
C  -1.760537 -1.810227 0.063645
C  -0.124111 0.715516 0.653916
C  1.339186 0.821996 0.40408
C  -1.094167 -2.231652 -1.083419
C  -1.594975 -2.509443 1.254156
C  -0.255984 -3.334693 -1.033389
C  -0.738822 -3.599988 1.305835
C  2.204334 0.169505 1.277849
C  1.865061 1.560444 -0.652415
C  -0.067531 -4.013398 0.163501
C  3.57381 0.228067 1.087864
C  3.234919 1.640189 -0.842669
C  4.077403 0.96526 0.026305
H  -3.820432 1.147056 -2.49997
H  -4.924587 0.732275 -1.184996
H  -4.778929 2.398391 -1.714635
H  -2.830942 2.417807 1.509549
H  -4.308389 1.487159 1.250158
H  -4.198302 3.142508 0.671184
H  -1.784312 2.613049 -2.089769
H  -2.870275 3.745089 -1.301484
H  -1.433887 3.200213 -0.454314
H  -0.457852 0.594829 -1.377354
H  -1.235408 -1.708421 -2.021654
H  -2.120351 -2.193137 2.14655
H  0.253981 -3.662489 -1.929982
H  -0.598387 -4.128257 2.239955
H  1.811529 -0.405498 2.106195
H  1.219182 2.104386 -1.330238
H  0.597985 -4.866144 0.204146
H  4.238097 -0.295737 1.761684
H  3.635053 2.225184 -1.659521
elementType: Cl O N C H
totalener: -1417.63450169 hartree
nucrepener: 2059.59891402 hartree
electener: -3477.23341571 hartree
oneelecener: -6029.65360246 hartree
twoeener: 2552.42018675 hartree
cpcmener: -0.03904374 hartree
kineticenergy: 1412.75599370 hartree
xcener: -114.607093956008 hartree
chargesum: -0.0000000
charge: -0.083607 -0.485663 -0.478483 -0.062562 -0.078007 0.212675 -0.314121 -0.338885 -0.316349 0.447618 0.030950 0.404002 0.048358 -0.196174 -0.196383 -0.174569 -0.190483 -0.211399 -0.199377 -0.121320 -0.144068 -0.156311 0.115119 0.099145 0.109620 0.100661 0.101199 0.105805 0.103032 0.108762 0.108193 0.105782 0.194642 0.148089 0.143802 0.156903 0.155872 0.144228 0.154141 0.159315 0.145706 0.144141
qa: -0.0836 -0.4857 -0.4785 -0.0626 -0.0780 0.2127 -0.3141 -0.3389 -0.3163 0.4476 0.0310 0.4040 0.0484 -0.1962 -0.1964 -0.1746 -0.1905 -0.2114 -0.1994 -0.1213 -0.1441 -0.1563 0.1151 0.0991 0.1096 0.1007 0.1012 0.1058 0.1030 0.1088 0.1082 0.1058 0.1946 0.1481 0.1438 0.1569 0.1559 0.1442 0.1541 0.1593 0.1457 0.1441
va: 1.2218 2.0163 2.0318 3.0247 3.1494 3.8240 3.8815 3.9143 3.9034 4.0092 3.5387 4.0925 3.5075 3.9306 3.9930 3.9274 3.9330 4.0472 4.0097 3.8739 3.9971 4.0257 3.8532 1.0076 1.0214 1.0049 1.0117 1.0218 1.0040 1.0033 1.0079 1.0029 0.9953 1.0083 1.0175 0.9927 0.9935 1.0197 1.0003 0.9893 1.0057 1.0077
dispcorr: -0.023811401 hartree
energy: -1417.658313093105
dipole: -30.15344 31.71947 1.56603 5.87168 -5.10277 0.76891 -5.61554 3.31564 -2.29990
magnitude: 2.88673 au
magnitude: 7.33749 debye
