program: Orca
programVersion: 5.0.2
elementType: O O O N N C C C C C C C C C C C C C C C C C C C C C C C C H H H H H H H H H H H H H H H H H H H H H H H H H H H H H H
charge: 0
multiplicity: 1
keywords: wb97x-d3
keywords: def2-TZVPP
keywords: def2/J RIJCOSX
keywords: DEFGRID2
keywords: scfconv7
keywords: smallprint printgap noloewdin
keywords: NOSOSCF
formula: C24H30N2O3
InChI: InChI=1/C24H30N2O3/c1-15-12-16(2)14-18(13-15)23(28)26(24(4,5)6)25-22(27)20-9-10-21-19(17(20)3)8-7-11-29-21/h9-10,12-14,25H,7-8,11H2,1-6H3
59 atoms
O  4.969636 2.370128 0.469991
O  -4.239612 -0.548493 0.016699
O  -0.970364 0.684938 1.957625
N  -2.452898 0.802684 -0.341344
N  -1.086083 0.846995 -0.292521
C  -3.210747 2.097983 -0.341238
C  3.31825 0.629616 0.177179
C  4.347372 -0.334433 -0.351454
C  5.621868 0.389151 -0.759981
C  1.974212 0.247723 0.301213
C  -4.212521 2.096555 -1.49525
C  -2.232325 3.245979 -0.575758
C  -3.915882 2.329687 0.995463
C  3.693197 1.923718 0.540375
C  1.035057 1.174969 0.747608
C  5.994161 1.393272 0.303446
C  -3.042877 -0.40984 -0.184788
C  -0.419277 0.86026 0.88376
C  2.749097 2.842201 0.995742
C  1.427906 2.465398 1.096898
C  1.577151 -1.156301 -0.046311
C  -2.171625 -1.618972 -0.297788
C  -2.062347 -2.464787 0.799157
C  -1.582773 -1.958874 -1.508877
C  -1.343296 -3.65154 0.701826
C  -0.878746 -3.152547 -1.634849
C  -0.764011 -3.979524 -0.521307
C  -1.186636 -4.558322 1.885682
C  -0.255954 -3.543883 -2.941625
H  4.575744 -1.085468 0.411317
H  3.941515 -0.883494 -1.203141
H  6.440796 -0.318765 -0.890804
H  5.483739 0.901481 -1.715301
H  -3.706235 1.95127 -2.450451
H  -4.715261 3.063601 -1.531171
H  -4.981414 1.334465 -1.394679
H  -1.671754 3.136291 -1.504606
H  -2.811037 4.166006 -0.654356
H  -1.527226 3.380312 0.244807
H  -4.694406 1.597409 1.194802
H  -4.38679 3.313638 0.983119
H  -3.208661 2.314496 1.824089
H  6.174084 0.888912 1.25933
H  6.893952 1.948716 0.043031
H  -0.592131 1.026539 -1.155608
H  3.059144 3.843152 1.267752
H  0.694176 3.181958 1.445019
H  2.276059 -1.878876 0.375823
H  0.588961 -1.41141 0.32973
H  1.569741 -1.314669 -1.126977
H  -2.531355 -2.197193 1.738912
H  -1.672868 -1.296894 -2.362799
H  -0.205005 -4.905624 -0.608448
H  -1.506185 -5.574947 1.653524
H  -1.76991 -4.209753 2.736807
H  -0.143511 -4.61707 2.20101
H  -0.166174 -2.691348 -3.613659
H  -0.855312 -4.300642 -3.451674
H  0.738245 -3.967194 -2.79801
elementType: O N C H
totalener: -1267.95071565 hartree
nucrepener: 2890.40423166 hartree
electener: -4158.35494731 hartree
oneelecener: -7470.85775814 hartree
twoeener: 3312.50281083 hartree
cpcmener: -0.05564287 hartree
kineticenergy: 1262.24870796 hartree
xcener: -124.602513660825 hartree
chargesum: -0.0000000
charge: -0.344508 -0.526649 -0.515289 -0.046602 -0.046282 0.216723 -0.043616 -0.111459 -0.132062 -0.114275 -0.321417 -0.319703 -0.346951 0.253074 0.092310 0.041281 0.395093 0.374359 -0.257740 -0.205828 -0.329481 0.089516 -0.211791 -0.197828 -0.025484 -0.038980 -0.163044 -0.225328 -0.229366 0.100323 0.093071 0.079881 0.076049 0.102339 0.103382 0.107274 0.113632 0.108156 0.105051 0.105572 0.106051 0.102487 0.090207 0.100858 0.197642 0.137689 0.154887 0.117929 0.065210 0.122861 0.129975 0.132878 0.125829 0.103731 0.093804 0.104924 0.096206 0.112787 0.100639
qa: -0.3445 -0.5266 -0.5153 -0.0466 -0.0463 0.2167 -0.0436 -0.1115 -0.1321 -0.1143 -0.3214 -0.3197 -0.3470 0.2531 0.0923 0.0413 0.3951 0.3744 -0.2577 -0.2058 -0.3295 0.0895 -0.2118 -0.1978 -0.0255 -0.0390 -0.1630 -0.2253 -0.2294 0.1003 0.0931 0.0799 0.0760 0.1023 0.1034 0.1073 0.1136 0.1082 0.1051 0.1056 0.1061 0.1025 0.0902 0.1009 0.1976 0.1377 0.1549 0.1179 0.0652 0.1229 0.1300 0.1329 0.1258 0.1037 0.0938 0.1049 0.0962 0.1128 0.1006
va: 2.0673 1.9693 1.9665 3.0339 3.1392 3.7919 3.6001 3.9577 3.9107 3.7820 3.8957 3.9228 3.9132 3.8028 3.5165 3.8723 4.0371 4.0585 4.0478 4.0151 3.9686 3.5689 3.9592 3.8798 3.7592 3.7360 3.8749 3.9032 3.9028 1.0024 1.0046 1.0145 1.0122 1.0072 1.0040 1.0204 1.0025 1.0061 1.0006 1.0215 1.0034 1.0134 0.9970 0.9909 0.9913 1.0144 0.9987 0.9994 1.0229 0.9850 1.0249 1.0160 1.0036 0.9960 1.0058 0.9939 1.0029 0.9946 0.9979
dispcorr: -0.035437731 hartree
energy: -1267.986153376614
dipole: 1.08473 2.27167 3.35640 -4.05416 3.96245 -0.09171 -8.65214 5.98898 -2.66316
magnitude: 4.28559 au
magnitude: 10.89310 debye
