program: Orca
programVersion: 5.0.2
elementType: O O O N N C C C C C C C C C C C C C C C C C C C C C C C C H H H H H H H H H H H H H H H H H H H H H H H H H H H H H H
charge: 0
multiplicity: 1
keywords: wb97x-d3
keywords: def2-TZVPP
keywords: def2/J RIJCOSX
keywords: DEFGRID2
keywords: scfconv7
keywords: smallprint printgap noloewdin
keywords: NOSOSCF
formula: C24H30N2O3
InChI: InChI=1/C24H30N2O3/c1-15-12-16(2)14-18(13-15)23(28)26(24(4,5)6)25-22(27)20-9-10-21-19(17(20)3)8-7-11-29-21/h9-10,12-14,25H,7-8,11H2,1-6H3
59 atoms
O  4.914727 2.068721 -0.364978
O  -4.207952 -0.656245 0.244192
O  -0.869292 0.593428 1.874517
N  -2.622299 0.901411 -0.204927
N  -1.272872 1.093837 -0.290323
C  -3.505565 2.099266 -0.037932
C  3.3024 0.492846 0.506569
C  4.381226 -0.50037 0.851787
C  5.758151 0.145337 0.841441
C  1.954861 0.20503 0.761584
C  -2.688549 3.354709 -0.337605
C  -4.035029 2.1956 1.393646
C  -4.652845 2.032955 -1.046345
C  3.641891 1.719603 -0.070397
C  0.978889 1.16087 0.462317
C  5.893218 1.031941 -0.37269
C  -3.058911 -0.380585 -0.066984
C  -0.455456 0.921113 0.77276
C  2.664483 2.663635 -0.372132
C  1.342493 2.380463 -0.106972
C  1.603763 -1.142685 1.323874
C  -2.078045 -1.483398 -0.31282
C  -1.322177 -1.561853 -1.477929
C  -2.000427 -2.495625 0.635795
C  -0.471785 -2.639646 -1.69402
C  -1.147188 -3.57868 0.446662
C  -0.392416 -3.633044 -0.720589
C  0.368101 -2.704697 -2.934749
C  -1.035402 -4.647498 1.492176
H  4.185609 -0.937576 1.832357
H  4.356806 -1.331372 0.140213
H  5.91335 0.736163 1.746801
H  6.537153 -0.616629 0.817386
H  -1.886654 3.516834 0.382806
H  -3.357076 4.213555 -0.277085
H  -2.260234 3.345221 -1.341012
H  -4.630289 3.103548 1.496592
H  -4.671025 1.355758 1.66462
H  -3.217995 2.253708 2.113016
H  -4.272757 1.925832 -2.063499
H  -5.220056 2.962601 -1.00142
H  -5.347134 1.219729 -0.852083
H  6.858539 1.535361 -0.403841
H  5.789358 0.442413 -1.290397
H  -0.886173 1.287685 -1.203047
H  2.948838 3.610274 -0.813009
H  0.588359 3.122989 -0.335897
H  2.205677 -1.925156 0.863941
H  1.7926 -1.185682 2.398429
H  0.562708 -1.409269 1.167709
H  -1.400267 -0.792642 -2.237661
H  -2.597711 -2.437764 1.538483
H  0.273407 -4.474328 -0.879483
H  1.235995 -2.047538 -2.849418
H  -0.19031 -2.384862 -3.814277
H  0.739051 -3.712442 -3.116464
H  -0.436735 -5.487319 1.142636
H  -2.015929 -5.029495 1.77864
H  -0.566418 -4.261737 2.399395
elementType: O N C H
totalener: -1267.95260909 hartree
nucrepener: 2907.84701069 hartree
electener: -4175.79961978 hartree
oneelecener: -7506.09813853 hartree
twoeener: 3330.29851875 hartree
cpcmener: -0.05507400 hartree
kineticenergy: 1262.25310477 hartree
xcener: -124.606482504782 hartree
chargesum: 0.0000000
charge: -0.342373 -0.527513 -0.518678 -0.038553 -0.082673 0.217406 -0.005075 -0.111357 -0.134706 -0.181078 -0.326042 -0.349792 -0.314618 0.252725 0.109844 0.041761 0.407877 0.384150 -0.253295 -0.198413 -0.317637 0.075440 -0.228626 -0.171932 -0.005774 -0.058182 -0.157509 -0.220099 -0.229976 0.095635 0.098351 0.077432 0.079587 0.105703 0.112121 0.114169 0.106813 0.104678 0.101740 0.102575 0.102473 0.106101 0.100852 0.091183 0.201215 0.137426 0.161362 0.117131 0.127700 0.051865 0.133082 0.123593 0.125970 0.103600 0.102653 0.095556 0.093805 0.105882 0.104442
qa: -0.3424 -0.5275 -0.5187 -0.0386 -0.0827 0.2174 -0.0051 -0.1114 -0.1347 -0.1811 -0.3260 -0.3498 -0.3146 0.2527 0.1098 0.0418 0.4079 0.3841 -0.2533 -0.1984 -0.3176 0.0754 -0.2286 -0.1719 -0.0058 -0.0582 -0.1575 -0.2201 -0.2300 0.0956 0.0984 0.0774 0.0796 0.1057 0.1121 0.1142 0.1068 0.1047 0.1017 0.1026 0.1025 0.1061 0.1009 0.0912 0.2012 0.1374 0.1614 0.1171 0.1277 0.0519 0.1331 0.1236 0.1260 0.1036 0.1027 0.0956 0.0938 0.1059 0.1044
va: 2.0712 1.9672 1.9746 3.0390 3.1446 3.8027 3.5422 3.9597 3.9134 3.8088 3.9067 3.9165 3.8842 3.8083 3.4158 3.8710 4.0543 4.0567 4.0752 3.9986 3.9819 3.5280 3.9281 3.9237 3.7562 3.7770 3.8652 3.9028 3.9060 1.0047 1.0027 1.0118 1.0149 0.9998 1.0074 1.0014 1.0033 1.0211 1.0122 1.0072 1.0043 1.0208 0.9911 0.9970 0.9892 1.0158 0.9920 0.9930 0.9980 1.0162 1.0138 1.0275 1.0079 0.9931 0.9991 1.0035 1.0048 0.9962 0.9933
dispcorr: -0.035239185 hartree
energy: -1267.987848272013
dipole: 0.62267 2.55561 3.17828 -3.45038 3.68279 0.23242 -2.29514 0.08128 -2.21386
magnitude: 3.88029 au
magnitude: 9.86291 debye
