program: Orca
programVersion: 5.0.2
elementType: O O O N N C C C C C C C C C C C C C C C C C C C C C C C C H H H H H H H H H H H H H H H H H H H H H H H H H H H H H H
charge: 0
multiplicity: 1
keywords: wb97x-d3
keywords: def2-TZVPP
keywords: def2/J RIJCOSX
keywords: DEFGRID2
keywords: scfconv7
keywords: smallprint printgap noloewdin
keywords: NOSOSCF
formula: C24H30N2O3
InChI: InChI=1/C24H30N2O3/c1-15-12-16(2)14-18(13-15)23(28)26(24(4,5)6)25-22(27)20-9-10-21-19(17(20)3)8-7-11-29-21/h9-10,12-14,25H,7-8,11H2,1-6H3
59 atoms
O  4.901009 2.09916 -0.308014
O  -4.19025 -0.660562 0.316801
O  -0.889265 0.539273 1.876693
N  -2.622928 0.888563 -0.219529
N  -1.270508 1.0793 -0.28463
C  -3.497986 2.093292 -0.053207
C  3.3002 0.507102 0.554106
C  4.38829 -0.472557 0.908884
C  5.752507 0.198606 0.925623
C  1.95397 0.2012 0.795175
C  -2.701792 3.328683 -0.467765
C  -3.934487 2.256094 1.401311
C  -4.706223 1.987886 -0.983078
C  3.631838 1.739547 -0.015085
C  0.97003 1.149071 0.496662
C  5.895393 1.076294 -0.292493
C  -3.05452 -0.391001 -0.043189
C  -0.465908 0.892887 0.786223
C  2.646347 2.678698 -0.310123
C  1.326319 2.379487 -0.05485
C  1.61608 -1.156784 1.339739
C  -2.082159 -1.495099 -0.313869
C  -1.969214 -2.502161 0.636423
C  -1.366099 -1.578049 -1.503575
C  -1.120056 -3.583943 0.423547
C  -0.526259 -2.658433 -1.746764
C  -0.410472 -3.646582 -0.771143
C  -0.958301 -4.636994 1.478166
C  0.261393 -2.734726 -3.020405
H  4.183718 -0.921989 1.882139
H  4.391649 -1.297776 0.189478
H  5.87478 0.801003 1.829016
H  6.546921 -0.548414 0.928181
H  -2.327267 3.258565 -1.490033
H  -1.863366 3.533118 0.197348
H  -3.368056 4.1900 -0.423278
H  -3.074093 2.355439 2.063145
H  -4.529832 3.165264 1.499034
H  -4.54455 1.426424 1.75221
H  -5.389249 1.186115 -0.716618
H  -4.392415 1.846148 -2.018326
H  -5.26757 2.921851 -0.933789
H  6.852769 1.594422 -0.314032
H  5.813008 0.478656 -1.206729
H  -0.871579 1.28153 -1.19031
H  2.920608 3.634078 -0.738769
H  0.565927 3.118215 -0.277406
H  1.793704 -1.209756 2.416293
H  0.580764 -1.437104 1.166936
H  2.235181 -1.92526 0.87802
H  -2.53387 -2.442004 1.559617
H  -1.469355 -0.81044 -2.262027
H  0.248546 -4.489486 -0.94907
H  -1.922976 -4.972583 1.859649
H  -0.395061 -4.250967 2.329961
H  -0.424578 -5.506905 1.098216
H  -0.31774 -2.37686 -3.871538
H  0.5829 -3.75321 -3.233943
H  1.159012 -2.115983 -2.960191
elementType: O N C H
totalener: -1267.95267436 hartree
nucrepener: 2906.32209426 hartree
electener: -4174.27476862 hartree
oneelecener: -7503.09979156 hartree
twoeener: 3328.82502294 hartree
cpcmener: -0.05510809 hartree
kineticenergy: 1262.25148393 hartree
xcener: -124.605885777772 hartree
chargesum: 0.0000000
charge: -0.341400 -0.524949 -0.519153 -0.048318 -0.075012 0.223440 -0.010039 -0.111913 -0.134704 -0.175447 -0.333053 -0.351341 -0.314400 0.255029 0.103451 0.041872 0.399938 0.389808 -0.253384 -0.200463 -0.312994 0.080267 -0.169780 -0.229496 -0.062519 -0.006240 -0.154831 -0.229191 -0.219818 0.095594 0.098310 0.077476 0.079785 0.116593 0.105709 0.111262 0.102012 0.107556 0.104182 0.106897 0.102663 0.102923 0.101078 0.091347 0.199978 0.137493 0.161827 0.126838 0.050070 0.116688 0.123016 0.133201 0.126089 0.105078 0.104546 0.094671 0.101672 0.095920 0.104169
qa: -0.3414 -0.5249 -0.5192 -0.0483 -0.0750 0.2234 -0.0100 -0.1119 -0.1347 -0.1754 -0.3331 -0.3513 -0.3144 0.2550 0.1035 0.0419 0.3999 0.3898 -0.2534 -0.2005 -0.3130 0.0803 -0.1698 -0.2295 -0.0625 -0.0062 -0.1548 -0.2292 -0.2198 0.0956 0.0983 0.0775 0.0798 0.1166 0.1057 0.1113 0.1020 0.1076 0.1042 0.1069 0.1027 0.1029 0.1011 0.0913 0.2000 0.1375 0.1618 0.1268 0.0501 0.1167 0.1230 0.1332 0.1261 0.1051 0.1045 0.0947 0.1017 0.0959 0.1042
va: 2.0731 1.9695 1.9747 3.0445 3.1517 3.8003 3.5453 3.9602 3.9128 3.8150 3.9070 3.9221 3.8781 3.8096 3.4225 3.8696 4.0564 4.0500 4.0746 3.9980 3.9762 3.5287 3.9166 3.9348 3.7812 3.7645 3.8689 3.9049 3.9019 1.0048 1.0027 1.0120 1.0148 1.0016 0.9998 1.0073 1.0115 1.0033 1.0198 1.0213 1.0072 1.0041 0.9910 0.9968 0.9891 1.0156 0.9915 0.9977 1.0182 0.9942 1.0285 1.0147 1.0076 0.9971 0.9927 1.0042 0.9995 1.0029 0.9932
dispcorr: -0.035116692 hartree
energy: -1267.987791051442
dipole: 0.74569 2.46565 3.21134 -3.27283 3.55346 0.28063 -2.58404 0.33845 -2.24559
magnitude: 3.92863 au
magnitude: 9.98578 debye
