program: Orca
programVersion: 5.0.2
elementType: O O O N N C C C C C C C C C C C C C C C C C C C C C C C C H H H H H H H H H H H H H H H H H H H H H H H H H H H H H H
charge: 0
multiplicity: 1
keywords: wb97x-d3
keywords: def2-TZVPP
keywords: def2/J RIJCOSX
keywords: DEFGRID2
keywords: scfconv7
keywords: smallprint printgap noloewdin
keywords: NOSOSCF
formula: C24H30N2O3
InChI: InChI=1/C24H30N2O3/c1-15-12-16(2)14-18(13-15)23(28)26(24(4,5)6)25-22(27)20-9-10-21-19(17(20)3)8-7-11-29-21/h9-10,12-14,25H,7-8,11H2,1-6H3
59 atoms
O  5.00442 2.340096 0.203932
O  -4.2577 -0.539425 0.042929
O  -0.921383 0.895883 1.936723
N  -2.465034 0.798524 -0.331154
N  -1.098084 0.842226 -0.31627
C  -3.232572 2.082503 -0.430531
C  3.322373 0.613131 0.060484
C  4.327132 -0.402104 -0.418075
C  5.604064 0.270306 -0.903063
C  1.97453 0.264103 0.236088
C  -4.183718 2.008934 -1.625929
C  -2.257497 3.231696 -0.676144
C  -3.99645 2.369688 0.863273
C  3.727041 1.921959 0.326694
C  1.058054 1.233697 0.638995
C  6.013685 1.345661 0.074267
C  -3.059335 -0.406873 -0.129186
C  -0.39874 0.956505 0.84034
C  2.805796 2.884001 0.737248
C  1.481819 2.537313 0.891683
C  1.552889 -1.154804 -0.005459
C  -2.178564 -1.616204 -0.145222
C  -1.623383 -2.069182 -1.338103
C  -2.028201 -2.348183 1.021794
C  -0.912678 -3.261738 -1.369904
C  -1.301859 -3.538115 1.017052
C  -0.756005 -3.977327 -0.182767
C  -0.318251 -3.775764 -2.647219
C  -1.125352 -4.31794 2.285441
H  4.560951 -1.102361 0.39057
H  3.898279 -1.004355 -1.221701
H  6.410568 -0.458634 -0.995447
H  5.455206 0.711193 -1.892241
H  -4.956943 1.253193 -1.508127
H  -3.636863 1.799702 -2.547088
H  -4.684194 2.970226 -1.750599
H  -1.582653 3.404148 0.162849
H  -1.66313 3.097594 -1.580766
H  -2.840571 4.143484 -0.807052
H  -3.32379 2.395544 1.720832
H  -4.776734 1.639892 1.063784
H  -4.475445 3.347386 0.788213
H  6.224439 0.909504 1.05765
H  6.908684 1.872775 -0.255204
H  -0.62503 0.946565 -1.202835
H  3.138417 3.895335 0.935146
H  0.769518 3.288072 1.211378
H  0.558994 -1.363621 0.382444
H  1.547571 -1.396189 -1.070915
H  2.235072 -1.857423 0.474967
H  -1.749221 -1.492607 -2.248043
H  -2.470462 -1.991755 1.94542
H  -0.189622 -4.902755 -0.196817
H  -0.911234 -4.597006 -3.055691
H  0.691084 -4.15825 -2.491229
H  -0.268178 -2.999298 -3.410137
H  -2.081024 -4.693675 2.655656
H  -0.699642 -3.698378 3.076324
H  -0.466728 -5.173813 2.142104
elementType: O N C H
totalener: -1267.96181741 hartree
nucrepener: 2889.59623182 hartree
electener: -4157.55804924 hartree
oneelecener: -7469.10860031 hartree
twoeener: 3311.55055107 hartree
cpcmener: -0.04366715 hartree
kineticenergy: 1262.23560361 hartree
xcener: -124.597466144283 hartree
chargesum: 0.0000000
charge: -0.329101 -0.491616 -0.473184 -0.040342 -0.057684 0.211363 -0.043241 -0.113739 -0.134908 -0.120321 -0.321017 -0.317266 -0.339614 0.248819 0.099577 0.040214 0.368621 0.337113 -0.252781 -0.198915 -0.319091 0.105104 -0.207154 -0.205125 -0.036152 -0.022387 -0.157002 -0.232986 -0.226349 0.099678 0.091315 0.078883 0.076804 0.109358 0.099278 0.101176 0.106344 0.110040 0.107107 0.101044 0.107580 0.102009 0.088001 0.098843 0.190854 0.135022 0.150334 0.059594 0.118096 0.115709 0.127714 0.126232 0.121350 0.113520 0.099400 0.093952 0.105640 0.103961 0.090321
qa: -0.3291 -0.4916 -0.4732 -0.0403 -0.0577 0.2114 -0.0432 -0.1137 -0.1349 -0.1203 -0.3210 -0.3173 -0.3396 0.2488 0.0996 0.0402 0.3686 0.3371 -0.2528 -0.1989 -0.3191 0.1051 -0.2072 -0.2051 -0.0362 -0.0224 -0.1570 -0.2330 -0.2263 0.0997 0.0913 0.0789 0.0768 0.1094 0.0993 0.1012 0.1063 0.1100 0.1071 0.1010 0.1076 0.1020 0.0880 0.0988 0.1909 0.1350 0.1503 0.0596 0.1181 0.1157 0.1277 0.1262 0.1214 0.1135 0.0994 0.0940 0.1056 0.1040 0.0903
va: 2.0860 2.0131 2.0191 3.0149 3.1115 3.7991 3.5942 3.9537 3.9144 3.7867 3.8982 3.9247 3.9093 3.8209 3.5053 3.8790 4.0745 4.1097 4.0481 4.0168 3.9631 3.5704 3.8854 3.9574 3.7336 3.7509 3.8734 3.9039 3.9094 1.0023 1.0046 1.0147 1.0113 1.0205 1.0075 1.0045 1.0002 1.0028 1.0071 1.0145 1.0225 1.0035 0.9964 0.9907 0.9972 1.0153 1.0005 1.0272 0.9866 1.0003 1.0161 1.0227 1.0072 0.9943 0.9973 1.0036 0.9943 0.9954 1.0054
dispcorr: -0.035453423 hartree
energy: -1267.997270836883
dipole: 0.74983 2.30571 3.05554 -4.77449 4.47528 -0.29921 -8.19145 5.79693 -2.39451
magnitude: 3.89352 au
magnitude: 9.89655 debye
