program: Orca
programVersion: 5.0.2
elementType: O O O N N C C C C C C C C C C C C C C C C C C C C C C C C H H H H H H H H H H H H H H H H H H H H H H H H H H H H H H
charge: 0
multiplicity: 1
keywords: wb97x-d3
keywords: def2-TZVPP
keywords: def2/J RIJCOSX
keywords: DEFGRID2
keywords: scfconv7
keywords: smallprint printgap noloewdin
keywords: NOSOSCF
formula: C24H30N2O3
InChI: InChI=1/C24H30N2O3/c1-15-12-16(2)14-18(13-15)23(28)26(24(4,5)6)25-22(27)20-9-10-21-19(17(20)3)8-7-11-29-21/h9-10,12-14,25H,7-8,11H2,1-6H3
59 atoms
O  4.840735 1.89654 -0.596077
O  -4.211342 -0.739336 0.227132
O  -0.912997 0.639961 1.929698
N  -2.668993 0.882124 -0.151652
N  -1.325333 1.109387 -0.240609
C  -3.5878 2.0466 0.043561
C  3.257769 0.474953 0.548784
C  4.34866 -0.464386 0.995068
C  5.719729 0.181812 0.866075
C  1.917453 0.232458 0.881554
C  -4.161447 2.062793 1.460779
C  -4.703568 1.990819 -0.999821
C  -2.799711 3.335835 -0.176162
C  3.585469 1.61039 -0.198149
C  0.935181 1.150575 0.490535
C  5.824385 0.875728 -0.469505
C  -3.073019 -0.417359 -0.062216
C  -0.499649 0.941945 0.824671
C  2.6060 2.527944 -0.569169
C  1.293776 2.293358 -0.225677
C  1.584835 -1.026383 1.631913
C  -2.046109 -1.47249 -0.337228
C  -1.336229 -1.518324 -1.532923
C  -1.865086 -2.463299 0.617758
C  -0.422919 -2.53791 -1.771071
C  -0.944718 -3.486989 0.40829
C  -0.235031 -3.506948 -0.787112
C  0.371297 -2.567363 -3.043289
C  -0.712513 -4.522964 1.466646
H  4.179588 -0.768147 2.029736
H  4.316042 -1.383134 0.400581
H  5.881739 0.905131 1.669356
H  6.507025 -0.568865 0.946416
H  -3.367694 2.072929 2.207978
H  -4.808007 1.211459 1.6610
H  -4.757141 2.966508 1.599623
H  -5.3540 1.127656 -0.88063
H  -5.326429 2.882091 -0.911233
H  -4.29221 1.973343 -2.010707
H  -2.344449 3.385613 -1.16634
H  -2.022628 3.489543 0.572877
H  -3.493329 4.173416 -0.097555
H  6.78553 1.372308 -0.598483
H  5.707653 0.153831 -1.286159
H  -0.939884 1.250713 -1.162635
H  2.882605 3.414177 -1.126366
H  0.54156 3.019413 -0.509288
H  0.547503 -1.32458 1.516287
H  2.197091 -1.860175 1.290342
H  1.770134 -0.909404 2.70245
H  -1.497544 -0.762658 -2.294005
H  -2.427555 -2.42911 1.543981
H  0.484899 -4.299794 -0.959856
H  1.21307 -1.873046 -2.992766
H  -0.232967 -2.276129 -3.902767
H  0.779707 -3.558182 -3.239792
H  -0.00924 -5.285828 1.134766
H  -1.640353 -5.02374 1.74746
H  -0.306972 -4.071378 2.374443
elementType: O N C H
totalener: -1267.96362665 hartree
nucrepener: 2914.51947382 hartree
electener: -4182.48310047 hartree
oneelecener: -7519.28673896 hartree
twoeener: 3336.80363849 hartree
cpcmener: -0.04252455 hartree
kineticenergy: 1262.24793993 hartree
xcener: -124.602405296802 hartree
chargesum: -0.0000000
charge: -0.325157 -0.490419 -0.480200 -0.042566 -0.089213 0.211403 -0.002884 -0.114130 -0.138250 -0.174611 -0.342458 -0.315566 -0.316689 0.256211 0.108259 0.040414 0.392021 0.352429 -0.254556 -0.198038 -0.333155 0.096950 -0.240654 -0.191424 -0.005532 -0.078446 -0.133091 -0.222212 -0.226107 0.095550 0.095795 0.078272 0.078951 0.101153 0.105818 0.102411 0.108695 0.099912 0.098777 0.106990 0.106310 0.110140 0.099294 0.088582 0.194957 0.134940 0.156894 0.083640 0.110773 0.125282 0.130123 0.122398 0.121502 0.103104 0.101177 0.094828 0.091070 0.108342 0.101992
qa: -0.3252 -0.4904 -0.4802 -0.0426 -0.0892 0.2114 -0.0029 -0.1141 -0.1383 -0.1746 -0.3425 -0.3156 -0.3167 0.2562 0.1083 0.0404 0.3920 0.3524 -0.2546 -0.1980 -0.3332 0.0970 -0.2407 -0.1914 -0.0055 -0.0784 -0.1331 -0.2222 -0.2261 0.0955 0.0958 0.0783 0.0790 0.1012 0.1058 0.1024 0.1087 0.0999 0.0988 0.1070 0.1063 0.1101 0.0993 0.0886 0.1950 0.1349 0.1569 0.0836 0.1108 0.1253 0.1301 0.1224 0.1215 0.1031 0.1012 0.0948 0.0911 0.1083 0.1020
va: 2.0919 2.0137 2.0236 3.0191 3.1222 3.8158 3.5300 3.9596 3.9148 3.8015 3.9112 3.8869 3.9049 3.8209 3.3955 3.8755 4.0736 4.1040 4.0760 3.9964 3.9771 3.5277 3.9311 3.9369 3.7643 3.7928 3.8580 3.9022 3.9063 1.0040 1.0025 1.0116 1.0147 1.0142 1.0219 1.0036 1.0213 1.0047 1.0075 1.0029 1.0014 1.0080 0.9908 0.9964 0.9956 1.0167 0.9950 1.0086 0.9931 0.9970 1.0150 1.0266 1.0083 0.9931 0.9994 1.0034 1.0055 0.9962 0.9934
dispcorr: -0.035271359 hartree
energy: -1267.998898005366
dipole: 0.79927 2.24924 3.04850 -2.94987 3.17796 0.22809 -1.20154 -0.63293 -1.83447
magnitude: 3.56521 au
magnitude: 9.06203 debye
