program: Orca
programVersion: 5.0.2
elementType: O O O N N C C C C C C C C C C C C C C C C C C C C C C C C H H H H H H H H H H H H H H H H H H H H H H H H H H H H H H
charge: 0
multiplicity: 1
keywords: wb97x-d3
keywords: def2-TZVPP
keywords: def2/J RIJCOSX
keywords: DEFGRID2
keywords: scfconv7
keywords: smallprint printgap noloewdin
keywords: NOSOSCF
formula: C24H30N2O3
InChI: InChI=1/C24H30N2O3/c1-15-12-16(2)14-18(13-15)23(28)26(24(4,5)6)25-22(27)20-9-10-21-19(17(20)3)8-7-11-29-21/h9-10,12-14,25H,7-8,11H2,1-6H3
59 atoms
O  4.963507 0.204876 -0.894454
O  -4.28038 -0.719436 0.320861
O  -0.68395 0.507238 1.967254
N  -2.595917 0.779554 0.038675
N  -1.25286 0.884348 -0.185422
C  -3.38575 2.013165 0.344626
C  3.382527 1.336496 0.53983
C  4.469857 2.180246 1.153489
C  5.748594 2.134413 0.329971
C  2.049713 1.457453 0.960488
C  -2.459041 3.22552 0.291793
C  -3.995345 1.934268 1.745292
C  -4.469575 2.191687 -0.718948
C  3.703875 0.416535 -0.463265
C  1.061634 0.682422 0.343474
C  6.026488 0.714613 -0.097413
C  -3.123043 -0.474292 0.034669
C  -0.351507 0.690574 0.809594
C  2.711395 -0.334688 -1.087363
C  1.401037 -0.19158 -0.689615
C  1.728161 2.445919 2.044575
C  -2.193269 -1.580006 -0.366826
C  -1.904132 -1.791621 -1.712788
C  -1.696115 -2.437687 0.599713
C  -1.108616 -2.862006 -2.098215
C  -0.880427 -3.510265 0.236529
C  -0.599628 -3.705877 -1.109057
C  -0.782044 -3.107804 -3.541396
C  -0.332607 -4.427179 1.289184
H  4.136474 3.215239 1.249012
H  4.669932 1.835646 2.173306
H  5.657856 2.770454 -0.554297
H  6.592154 2.51082 0.910255
H  -1.685549 3.198151 1.060045
H  -3.060963 4.116258 0.473792
H  -1.981158 3.352337 -0.680101
H  -4.472303 2.886069 1.984324
H  -4.752922 1.159355 1.832341
H  -3.227592 1.749572 2.497088
H  -5.027584 3.108503 -0.52314
H  -5.184771 1.371705 -0.731738
H  -4.029017 2.2779 -1.713911
H  6.921813 0.64127 -0.713842
H  6.166988 0.069915 0.777917
H  -0.947276 1.073559 -1.129352
H  2.977678 -1.035253 -1.868897
H  0.639295 -0.799826 -1.16267
H  2.163897 2.140643 2.998906
H  2.140854 3.428561 1.811914
H  0.6623 2.580569 2.20367
H  -2.302185 -1.119005 -2.464685
H  -1.930861 -2.272617 1.645273
H  0.031342 -4.539013 -1.401243
H  -1.102396 -4.101963 -3.857789
H  0.293471 -3.04896 -3.719158
H  -1.265089 -2.380989 -4.193603
H  0.329051 -5.180107 0.862088
H  -1.1342 -4.950125 1.814158
H  0.232628 -3.874454 2.041474
elementType: O N C H
totalener: -1267.96365385 hartree
nucrepener: 2886.39466367 hartree
electener: -4154.35831752 hartree
oneelecener: -7463.14669123 hartree
twoeener: 3308.78837372 hartree
cpcmener: -0.04178095 hartree
kineticenergy: 1262.22874316 hartree
xcener: -124.597310191597 hartree
chargesum: -0.0000000
charge: -0.326665 -0.491944 -0.480861 -0.036774 -0.053780 0.193527 -0.012972 -0.123167 -0.135970 -0.165071 -0.299695 -0.330863 -0.322770 0.253827 0.172342 0.041056 0.373766 0.248514 -0.262248 -0.194828 -0.313660 0.085874 -0.166130 -0.210215 -0.030349 -0.036837 -0.165161 -0.226703 -0.226536 0.094097 0.100731 0.076751 0.079261 0.106046 0.105638 0.107143 0.101114 0.107307 0.098896 0.100461 0.108422 0.099403 0.098989 0.089176 0.194292 0.131538 0.148636 0.114487 0.110504 0.090933 0.126966 0.126840 0.125088 0.107487 0.102437 0.091327 0.090560 0.105914 0.103845
qa: -0.3267 -0.4919 -0.4809 -0.0368 -0.0538 0.1935 -0.0130 -0.1232 -0.1360 -0.1651 -0.2997 -0.3309 -0.3228 0.2538 0.1723 0.0411 0.3738 0.2485 -0.2622 -0.1948 -0.3137 0.0859 -0.1661 -0.2102 -0.0303 -0.0368 -0.1652 -0.2267 -0.2265 0.0941 0.1007 0.0768 0.0793 0.1060 0.1056 0.1071 0.1011 0.1073 0.0989 0.1005 0.1084 0.0994 0.0990 0.0892 0.1943 0.1315 0.1486 0.1145 0.1105 0.0909 0.1270 0.1268 0.1251 0.1075 0.1024 0.0913 0.0906 0.1059 0.1038
va: 2.0907 2.0107 2.0037 3.0157 3.1180 3.8199 3.5504 3.9495 3.9142 3.8220 3.9174 3.9011 3.9093 3.8177 3.3004 3.8771 4.0733 4.1446 4.1173 3.9532 3.9619 3.6187 3.8686 3.9613 3.7602 3.7818 3.9057 3.9034 3.9110 1.0083 1.0006 1.0114 1.0145 1.0014 1.0067 1.0044 1.0042 1.0227 1.0174 1.0048 1.0199 1.0062 0.9909 0.9968 1.0012 1.0175 1.0029 0.9931 0.9962 1.0160 1.0159 1.0230 1.0053 0.9950 0.9944 1.0064 1.0057 0.9944 0.9957
dispcorr: -0.034468174 hartree
energy: -1267.998122022633
dipole: 0.84806 2.10206 2.95012 9.74767 -8.03228 1.71539 0.97436 -2.46648 -1.49213
magnitude: 3.72454 au
magnitude: 9.46702 debye
