program: Orca
programVersion: 5.0.2
elementType: O O O N N C C C C C C C C C C C C C C C C C C C C C C C C H H H H H H H H H H H H H H H H H H H H H H H H H H H H H H
charge: 0
multiplicity: 1
keywords: wb97x-d3
keywords: def2-TZVPP
keywords: def2/J RIJCOSX
keywords: DEFGRID2
keywords: scfconv7
keywords: smallprint printgap noloewdin
keywords: NOSOSCF
formula: C24H30N2O3
InChI: InChI=1/C24H30N2O3/c1-15-12-16(2)14-18(13-15)23(28)26(24(4,5)6)25-22(27)20-9-10-21-19(17(20)3)8-7-11-29-21/h9-10,12-14,25H,7-8,11H2,1-6H3
59 atoms
O  4.85114 1.787651 -0.619959
O  -4.22337 -0.701981 0.038426
O  -0.955012 0.748205 1.928587
N  -2.666511 0.931572 -0.19154
N  -1.323438 1.167601 -0.258278
C  -3.600755 2.08802 -0.019073
C  3.221151 0.384689 0.478356
C  4.263927 -0.650351 0.810829
C  5.525338 -0.457242 -0.016881
C  1.883204 0.20606 0.862747
C  -2.80218 3.38587 -0.11804
C  -4.276877 2.043836 1.352428
C  -4.636865 2.077515 -1.143465
C  3.58656 1.529966 -0.232993
C  0.928046 1.159878 0.489665
C  5.89358 1.005785 -0.04772
C  -3.067675 -0.371008 -0.159199
C  -0.515771 1.004041 0.822099
C  2.633117 2.478463 -0.595098
C  1.316637 2.281963 -0.245843
C  1.537109 -1.042749 1.621821
C  -2.015928 -1.421151 -0.363419
C  -1.902108 -2.40887 0.606101
C  -1.216446 -1.46895 -1.501793
C  -0.966855 -3.430915 0.468758
C  -0.284488 -2.486337 -1.666942
C  -0.170549 -3.453094 -0.670337
C  -0.800942 -4.459406 1.546569
C  0.613148 -2.515648 -2.868659
H  4.506377 -0.599388 1.877361
H  3.867148 -1.653036 0.642561
H  6.352891 -1.028514 0.405933
H  5.373448 -0.819183 -1.037054
H  -2.076431 3.495927 0.688266
H  -3.501116 4.218943 -0.037701
H  -2.283478 3.490489 -1.071859
H  -3.538361 2.034277 2.154496
H  -4.892589 2.935669 1.480229
H  -4.925703 1.179661 1.474652
H  -5.264287 2.96695 -1.068413
H  -5.294485 1.211924 -1.105265
H  -4.152419 2.09635 -2.121416
H  6.10737 1.369689 0.963661
H  6.773923 1.190621 -0.662547
H  -0.920925 1.286479 -1.176138
H  2.933998 3.36144 -1.14489
H  0.585288 3.030957 -0.524297
H  1.748285 -1.931372 1.024082
H  2.139244 -1.12471 2.529027
H  0.496533 -1.092263 1.920611
H  -2.531641 -2.373934 1.488142
H  -1.318904 -0.717369 -2.276905
H  0.563305 -4.243762 -0.785465
H  -1.748734 -4.939766 1.794248
H  -0.423213 -4.005332 2.465328
H  -0.098973 -5.23866 1.251625
H  1.050334 -3.502562 -3.017989
H  1.438254 -1.808739 -2.754989
H  0.080285 -2.243226 -3.780026
elementType: O N C H
totalener: -1267.96232727 hartree
nucrepener: 2925.03051050 hartree
electener: -4192.99283777 hartree
oneelecener: -7540.23294793 hartree
twoeener: 3347.24011016 hartree
cpcmener: -0.04212944 hartree
kineticenergy: 1262.23634889 hartree
xcener: -124.600849961061 hartree
chargesum: 0.0000000
charge: -0.325912 -0.492770 -0.481096 -0.036652 -0.092195 0.205621 0.003029 -0.117362 -0.135022 -0.197007 -0.311494 -0.340740 -0.316986 0.253093 0.134033 0.040818 0.405918 0.348176 -0.255036 -0.199244 -0.357570 0.131849 -0.257711 -0.266450 -0.019629 0.026445 -0.181201 -0.224938 -0.220506 0.100854 0.091996 0.079239 0.077300 0.107790 0.110378 0.105459 0.100118 0.102057 0.106864 0.099502 0.108425 0.098983 0.088752 0.098943 0.196227 0.135321 0.156085 0.111666 0.123753 0.106601 0.122537 0.128592 0.122355 0.108517 0.102431 0.091566 0.094978 0.101563 0.101688
qa: -0.3259 -0.4928 -0.4811 -0.0367 -0.0922 0.2056 0.0030 -0.1174 -0.1350 -0.1970 -0.3115 -0.3407 -0.3170 0.2531 0.1340 0.0408 0.4059 0.3482 -0.2550 -0.1992 -0.3576 0.1318 -0.2577 -0.2665 -0.0196 0.0264 -0.1812 -0.2249 -0.2205 0.1009 0.0920 0.0792 0.0773 0.1078 0.1104 0.1055 0.1001 0.1021 0.1069 0.0995 0.1084 0.0990 0.0888 0.0989 0.1962 0.1353 0.1561 0.1117 0.1238 0.1066 0.1225 0.1286 0.1224 0.1085 0.1024 0.0916 0.0950 0.1016 0.1017
va: 2.0914 2.0117 2.0162 3.0221 3.1102 3.8188 3.5198 3.9521 3.9163 3.7923 3.9016 3.9096 3.8924 3.8207 3.3541 3.8772 4.0676 4.1038 4.0683 3.9961 3.9805 3.4749 3.9908 3.9465 3.7376 3.7144 3.8536 3.9042 3.9010 1.0024 1.0056 1.0146 1.0117 1.0021 1.0075 1.0033 1.0145 1.0038 1.0222 1.0049 1.0209 1.0070 0.9964 0.9906 0.9961 1.0162 0.9957 0.9822 0.9972 1.0163 1.0256 1.0163 1.0086 0.9968 0.9934 1.0054 1.0035 0.9930 0.9999
dispcorr: -0.035886684 hartree
energy: -1267.998213954691
dipole: 0.83102 2.28882 3.11984 -3.27022 3.48838 0.21816 -0.91664 -0.64922 -1.56586
magnitude: 3.49756 au
magnitude: 8.89009 debye
