program: Orca
programVersion: 5.0.2
elementType: O O O N N C C C C C C C C C C C C C C C C C C C C C C C C H H H H H H H H H H H H H H H H H H H H H H H H H H H H H H
charge: 0
multiplicity: 1
keywords: wb97x-d3
keywords: def2-TZVPP
keywords: def2/J RIJCOSX
keywords: DEFGRID2
keywords: scfconv7
keywords: smallprint printgap noloewdin
keywords: NOSOSCF
formula: C24H30N2O3
InChI: InChI=1/C24H30N2O3/c1-15-12-16(2)14-18(13-15)23(28)26(24(4,5)6)25-22(27)20-9-10-21-19(17(20)3)8-7-11-29-21/h9-10,12-14,25H,7-8,11H2,1-6H3
59 atoms
O  4.903237 1.930927 -0.348446
O  -4.137181 -0.636715 0.357045
O  -0.967776 0.618301 1.884258
N  -2.626855 0.941267 -0.286227
N  -1.278476 1.174037 -0.287125
C  -3.535996 2.107487 -0.096656
C  3.259161 0.417034 0.565531
C  4.31026 -0.620481 0.865943
C  5.603994 -0.333323 0.118163
C  1.913499 0.182774 0.880749
C  -2.813657 3.365244 -0.581647
C  -3.918127 2.2856 1.373421
C  -4.783093 1.925502 -0.96557
C  3.62894 1.617493 -0.043395
C  0.951974 1.136644 0.534155
C  5.925692 1.14049 0.224308
C  -3.03009 -0.353949 -0.034593
C  -0.499648 0.941788 0.818245
C  2.668851 2.565625 -0.38229
C  1.345073 2.313691 -0.1045
C  1.559407 -1.121592 1.536189
C  -2.027963 -1.432179 -0.31815
C  -1.855515 -2.425065 0.636845
C  -1.349088 -1.513131 -1.526185
C  -0.98402 -3.481069 0.410143
C  -0.482224 -2.568448 -1.786247
C  -0.308371 -3.537345 -0.805321
C  -0.746212 -4.51763 1.468524
C  0.260527 -2.640947 -3.089018
H  4.503916 -0.650863 1.943788
H  3.944266 -1.614574 0.602124
H  6.426507 -0.922472 0.527294
H  5.505791 -0.609544 -0.934702
H  -3.507737 4.203982 -0.529544
H  -2.487516 3.27994 -1.620245
H  -1.951767 3.620776 0.033623
H  -4.479066 1.433585 1.748694
H  -3.035886 2.413337 1.999174
H  -4.541597 3.174705 1.484148
H  -4.509562 1.75835 -2.008877
H  -5.384779 2.83441 -0.922642
H  -5.406009 1.09952 -0.636714
H  6.065702 1.421062 1.275951
H  6.838482 1.397851 -0.312534
H  -0.826746 1.240765 -1.18467
H  2.976324 3.491146 -0.850458
H  0.605395 3.064905 -0.353968
H  2.192038 -1.302779 2.406318
H  0.529805 -1.160656 1.870597
H  1.712265 -1.95439 0.84546
H  -2.402095 -2.361935 1.569398
H  -1.515594 -0.764721 -2.294022
H  0.366199 -4.36555 -0.996468
H  -0.502479 -5.487728 1.036293
H  -1.619495 -4.646133 2.106639
H  0.086475 -4.229857 2.114586
H  -0.393325 -2.431861 -3.936052
H  0.699151 -3.625337 -3.246905
H  1.073575 -1.91289 -3.119635
totalener: -1267.92996823 hartree
nucrepener: 2917.37113700 hartree
electener: -4185.30110522 hartree
oneelecener: -7524.14208035 hartree
twoeener: 3338.84097512 hartree
kineticenergy: 1262.30247085 hartree
xcener: -124.602138966152 hartree
chargesum: -0.0000000
charge: -0.284177 -0.382332 -0.367079 -0.085157 -0.105830 0.178038 0.020425 -0.134865 -0.144290 -0.166473 -0.305756 -0.311578 -0.289855 0.224618 0.152467 0.032625 0.350516 0.291577 -0.211204 -0.199377 -0.346112 0.156482 -0.209488 -0.265362 0.010161 0.053722 -0.172473 -0.215020 -0.228715 0.093695 0.086441 0.073357 0.076278 0.095568 0.092660 0.096497 0.112235 0.102962 0.085660 0.083133 0.084201 0.125126 0.076162 0.089089 0.155937 0.117449 0.133647 0.105662 0.125989 0.095785 0.101990 0.101994 0.090458 0.087348 0.094515 0.094287 0.095792 0.082132 0.098464
qa: -0.2842 -0.3823 -0.3671 -0.0852 -0.1058 0.1780 0.0204 -0.1349 -0.1443 -0.1665 -0.3058 -0.3116 -0.2899 0.2246 0.1525 0.0326 0.3505 0.2916 -0.2112 -0.1994 -0.3461 0.1565 -0.2095 -0.2654 0.0102 0.0537 -0.1725 -0.2150 -0.2287 0.0937 0.0864 0.0734 0.0763 0.0956 0.0927 0.0965 0.1122 0.1030 0.0857 0.0831 0.0842 0.1251 0.0762 0.0891 0.1559 0.1174 0.1336 0.1057 0.1260 0.0958 0.1020 0.1020 0.0905 0.0873 0.0945 0.0943 0.0958 0.0821 0.0985
va: 2.1278 2.1252 2.1372 3.0049 3.0955 3.9243 3.5074 3.9430 3.9217 3.8786 3.9140 3.9214 3.8633 3.9173 3.3792 3.9126 4.0856 4.1165 4.0992 4.0033 3.9635 3.5592 4.0231 3.9904 3.7187 3.7768 3.9194 3.9074 3.9110 1.0016 1.0052 1.0161 1.0115 1.0143 1.0071 1.0047 1.0231 1.0127 1.0039 1.0122 1.0070 1.0221 0.9960 0.9913 1.0228 1.0208 1.0020 0.9989 1.0219 0.9870 1.0351 1.0235 1.0145 1.0034 1.0060 0.9919 0.9998 1.0076 0.9926
dispcorr: -0.035399085 hartree
energy: -1267.965367312401
dipole: 0.57681 1.57253 2.14934 -3.48643 3.40399 -0.08244 -2.50525 1.51526 -0.99000
magnitude: 2.36781 au
magnitude: 6.01850 debye
