program: Orca
programVersion: 5.0.2
elementType: O O O N N C C C C C C C C C C C C C C C C C C C C C C C C H H H H H H H H H H H H H H H H H H H H H H H H H H H H H H
charge: 0
multiplicity: 1
keywords: wb97x-d3
keywords: def2-TZVPP
keywords: def2/J RIJCOSX
keywords: DEFGRID2
keywords: scfconv7
keywords: smallprint printgap noloewdin
keywords: NOSOSCF
formula: C24H30N2O3
InChI: InChI=1/C24H30N2O3/c1-15-12-16(2)14-18(13-15)23(28)26(24(4,5)6)25-22(27)20-9-10-21-19(17(20)3)8-7-11-29-21/h9-10,12-14,25H,7-8,11H2,1-6H3
59 atoms
O  4.91245 2.019691 -0.514957
O  -4.138125 -0.611941 0.5105
O  -0.85208 0.574555 1.817907
N  -2.629461 0.905412 -0.265995
N  -1.279165 1.114893 -0.338874
C  -3.504742 2.095601 -0.06152
C  3.318972 0.49855 0.477725
C  4.41399 -0.441871 0.913342
C  5.772557 0.242784 0.879995
C  1.976125 0.212865 0.753864
C  -3.788459 2.329545 1.422473
C  -4.808323 1.911764 -0.843415
C  -2.794971 3.322587 -0.635109
C  3.649558 1.681207 -0.188357
C  0.988969 1.134246 0.393744
C  5.907939 1.021464 -0.408994
C  -3.045352 -0.370757 0.054544
C  -0.445455 0.90615 0.72971
C  2.662884 2.594824 -0.544827
C  1.347009 2.317518 -0.250556
C  1.634855 -1.090795 1.417507
C  -2.083751 -1.48399 -0.229583
C  -1.439112 -1.619445 -1.454592
C  -1.90409 -2.445551 0.752179
C  -0.603632 -2.69928 -1.70148
C  -1.055885 -3.527055 0.538549
C  -0.416146 -3.636851 -0.688865
C  0.069087 -2.867545 -3.032742
C  -0.817365 -4.526329 1.632037
H  4.211315 -0.810162 1.920661
H  4.430392 -1.326575 0.267314
H  5.878026 0.922066 1.729461
H  6.577257 -0.490537 0.955562
H  -4.397529 3.227364 1.542295
H  -2.86687 2.471209 1.985694
H  -4.329513 1.495935 1.862733
H  -5.38215 2.83861 -0.802853
H  -4.604748 1.694054 -1.89329
H  -5.430037 1.118321 -0.441183
H  -3.468885 4.176202 -0.564511
H  -2.542621 3.197236 -1.69015
H  -1.889092 3.581533 -0.088195
H  6.862625 1.543157 -0.471102
H  5.842757 0.340922 -1.267638
H  -0.874632 1.18895 -1.257915
H  2.943744 3.514071 -1.041168
H  0.587427 3.046439 -0.506286
H  0.616437 -1.407495 1.216709
H  2.290731 -1.890112 1.07517
H  1.739502 -1.017904 2.502005
H  -1.605578 -0.889657 -2.239493
H  -2.414759 -2.335034 1.70054
H  0.247757 -4.476711 -0.864964
H  0.160339 -1.919079 -3.561153
H  -0.494857 -3.545642 -3.675989
H  1.071097 -3.282654 -2.92513
H  -1.756192 -4.904106 2.037859
H  -0.267685 -4.075393 2.460441
H  -0.240329 -5.380273 1.279498
totalener: -1267.93034226 hartree
nucrepener: 2908.25196048 hartree
electener: -4176.18230274 hartree
oneelecener: -7506.00287063 hartree
twoeener: 3329.82056789 hartree
kineticenergy: 1262.30375014 hartree
xcener: -124.602495580648 hartree
chargesum: 0.0000000
charge: -0.283459 -0.384190 -0.356969 -0.083609 -0.104974 0.181334 0.021743 -0.139481 -0.146772 -0.169748 -0.311176 -0.289474 -0.311562 0.226332 0.133768 0.032751 0.335813 0.280385 -0.212668 -0.198113 -0.269212 0.082136 -0.224152 -0.093251 0.021200 -0.058586 -0.116379 -0.229390 -0.225510 0.091899 0.087589 0.079782 0.072629 0.085961 0.101875 0.112682 0.084141 0.083285 0.125444 0.095864 0.093883 0.097464 0.089353 0.073423 0.155844 0.117148 0.134179 0.062812 0.093755 0.113952 0.098044 0.101122 0.089378 0.080793 0.105079 0.085786 0.103228 0.098558 0.078257
qa: -0.2835 -0.3842 -0.3570 -0.0836 -0.1050 0.1813 0.0217 -0.1395 -0.1468 -0.1697 -0.3112 -0.2895 -0.3116 0.2263 0.1338 0.0328 0.3358 0.2804 -0.2127 -0.1981 -0.2692 0.0821 -0.2242 -0.0933 0.0212 -0.0586 -0.1164 -0.2294 -0.2255 0.0919 0.0876 0.0798 0.0726 0.0860 0.1019 0.1127 0.0841 0.0833 0.1254 0.0959 0.0939 0.0975 0.0894 0.0734 0.1558 0.1171 0.1342 0.0628 0.0938 0.1140 0.0980 0.1011 0.0894 0.0808 0.1051 0.0858 0.1032 0.0986 0.0783
va: 2.1286 2.1223 2.1540 3.0047 3.0918 3.9198 3.4971 3.9523 3.9198 3.9268 3.9224 3.8621 3.9161 3.9164 3.4016 3.9119 4.1159 4.1339 4.1090 4.0184 3.9713 3.6402 3.9662 3.9359 3.8018 3.7958 3.9161 3.9204 3.9129 1.0040 1.0006 1.0115 1.0160 1.0040 1.0122 1.0231 1.0067 1.0125 1.0223 1.0148 1.0065 1.0041 0.9913 0.9954 1.0217 1.0214 1.0019 1.0332 0.9974 1.0006 1.0237 1.0346 1.0127 1.0053 0.9920 1.0022 0.9994 0.9933 1.0073
dispcorr: -0.035019605 hartree
energy: -1267.965361862863
dipole: 0.43140 1.63407 2.06547 -3.37778 3.22825 -0.14953 -2.03496 0.93052 -1.10444
magnitude: 2.34698 au
magnitude: 5.96554 debye
