program: Orca
programVersion: 5.0.2
elementType: O O O N N C C C C C C C C C C C C C C C C C C C C C C C C H H H H H H H H H H H H H H H H H H H H H H H H H H H H H H
charge: 0
multiplicity: 1
keywords: wb97x-d3
keywords: def2-TZVPP
keywords: def2/J RIJCOSX
keywords: DEFGRID2
keywords: scfconv7
keywords: smallprint printgap noloewdin
keywords: NOSOSCF
formula: C24H30N2O3
InChI: InChI=1/C24H30N2O3/c1-15-12-16(2)14-18(13-15)23(28)26(24(4,5)6)25-22(27)20-9-10-21-19(17(20)3)8-7-11-29-21/h9-10,12-14,25H,7-8,11H2,1-6H3
59 atoms
O  4.934537 2.073751 0.010709
O  -4.144709 -0.639211 0.272718
O  -0.945815 0.378132 1.825871
N  -2.605201 0.935899 -0.302864
N  -1.252979 1.146108 -0.280218
C  -3.486979 2.104753 -0.022629
C  3.294625 0.450345 0.72682
C  4.367588 -0.534135 1.117919
C  5.724777 0.144636 1.231253
C  1.939771 0.134794 0.889136
C  -4.760477 1.997426 -0.86569
C  -2.756032 3.375493 -0.459248
C  -3.822461 2.204849 1.465324
C  3.656083 1.701763 0.222023
C  0.969533 1.091443 0.579384
C  5.922422 1.06349 0.046694
C  -3.035686 -0.363062 -0.118903
C  -0.479705 0.825789 0.805148
C  2.685795 2.651108 -0.083312
C  1.356723 2.341521 0.098585
C  1.569696 -1.235777 1.3807
C  -2.068697 -1.449636 -0.474164
C  -1.370658 -1.460407 -1.676234
C  -1.951068 -2.519562 0.399088
C  -0.536031 -2.520084 -2.0034
C  -1.114798 -3.589819 0.100917
C  -0.415306 -3.57175 -1.099302
C  0.239705 -2.516445 -3.288855
C  -0.974319 -4.729439 1.067105
H  4.11141 -1.007706 2.067504
H  4.421172 -1.344589 0.382658
H  5.786299 0.723791 2.155677
H  6.525757 -0.595795 1.263977
H  -4.516958 1.872442 -1.922378
H  -5.332623 2.920797 -0.765325
H  -5.399948 1.175168 -0.5606
H  -3.434116 4.221263 -0.346498
H  -1.87529 3.585159 0.146553
H  -2.457861 3.338683 -1.50917
H  -4.440001 3.087175 1.64349
H  -2.921318 2.298349 2.070487
H  -4.373456 1.334233 1.811901
H  6.879658 1.582388 0.088471
H  5.896085 0.486198 -0.886495
H  -0.799823 1.320154 -1.162413
H  2.989175 3.621992 -0.451787
H  0.607996 3.094496 -0.116242
H  1.626778 -1.289124 2.469956
H  0.56165 -1.524597 1.101003
H  2.241916 -1.992534 0.978343
H  -1.497382 -0.648805 -2.384381
H  -2.511545 -2.509767 1.325532
H  0.235358 -4.404936 -1.343648
H  -0.292332 -1.984516 -4.077138
H  0.433721 -3.527816 -3.645412
H  1.207005 -2.025307 -3.161038
H  -0.531823 -4.397239 2.007652
H  -0.343689 -5.522376 0.66735
H  -1.944299 -5.166619 1.305909
totalener: -1267.93046085 hartree
nucrepener: 2905.88299432 hartree
electener: -4173.81345517 hartree
oneelecener: -7501.25955858 hartree
twoeener: 3327.44610341 hartree
kineticenergy: 1262.30406300 hartree
xcener: -124.602151083150 hartree
chargesum: 0.0000000
charge: -0.283714 -0.383704 -0.356734 -0.084708 -0.102782 0.183903 0.023488 -0.139540 -0.146311 -0.176995 -0.289662 -0.314672 -0.311856 0.223923 0.135386 0.032781 0.336669 0.282255 -0.209074 -0.200420 -0.266799 0.080258 -0.222513 -0.093818 0.016611 -0.057332 -0.114598 -0.229239 -0.228145 0.092436 0.087769 0.079599 0.072743 0.084007 0.083981 0.124927 0.095818 0.097234 0.094361 0.086459 0.101300 0.113686 0.089509 0.073199 0.156172 0.116648 0.133858 0.112940 0.062267 0.093341 0.099847 0.100660 0.089400 0.087901 0.087612 0.098816 0.099151 0.076946 0.104751
qa: -0.2837 -0.3837 -0.3567 -0.0847 -0.1028 0.1839 0.0235 -0.1395 -0.1463 -0.1770 -0.2897 -0.3147 -0.3119 0.2239 0.1354 0.0328 0.3367 0.2823 -0.2091 -0.2004 -0.2668 0.0803 -0.2225 -0.0938 0.0166 -0.0573 -0.1146 -0.2292 -0.2281 0.0924 0.0878 0.0796 0.0727 0.0840 0.0840 0.1249 0.0958 0.0972 0.0944 0.0865 0.1013 0.1137 0.0895 0.0732 0.1562 0.1166 0.1339 0.1129 0.0623 0.0933 0.0998 0.1007 0.0894 0.0879 0.0876 0.0988 0.0992 0.0769 0.1048
va: 2.1278 2.1227 2.1534 3.0057 3.0943 3.9185 3.4938 3.9528 3.9190 3.9246 3.8625 3.9171 3.9232 3.9175 3.4011 3.9120 4.1111 4.1308 4.1079 4.0218 3.9728 3.6385 3.9704 3.9372 3.8242 3.7999 3.9222 3.9140 3.9146 1.0041 1.0006 1.0118 1.0160 1.0123 1.0068 1.0224 1.0148 1.0042 1.0066 1.0037 1.0118 1.0229 0.9914 0.9957 1.0209 1.0214 1.0023 1.0010 1.0332 0.9973 1.0232 1.0353 1.0140 1.0040 1.0041 0.9916 0.9945 1.0080 0.9977
dispcorr: -0.034890742 hartree
energy: -1267.965351592610
dipole: 0.50157 1.61817 2.11973 -3.17974 3.14910 -0.03064 -2.56621 1.55247 -1.01375
magnitude: 2.34987 au
magnitude: 5.97290 debye
