program: Orca
programVersion: 5.0.2
elementType: O O O N N C C C C C C C C C C C C C C C C C C C C C C C C H H H H H H H H H H H H H H H H H H H H H H H H H H H H H H
charge: 0
multiplicity: 1
keywords: wb97x-d3
keywords: def2-TZVPP
keywords: def2/J RIJCOSX
keywords: DEFGRID2
keywords: scfconv7
keywords: smallprint printgap noloewdin
keywords: NOSOSCF
formula: C24H30N2O3
InChI: InChI=1/C24H30N2O3/c1-15-12-16(2)14-18(13-15)23(28)26(24(4,5)6)25-22(27)20-9-10-21-19(17(20)3)8-7-11-29-21/h9-10,12-14,25H,7-8,11H2,1-6H3
59 atoms
O  4.929444 0.093641 -0.888811
O  -4.293291 -0.680433 0.28564
O  -0.734145 0.594684 2.011983
N  -2.589827 0.798571 -0.0168
N  -1.236639 0.879698 -0.175024
C  -3.364581 2.026006 0.329385
C  3.366927 1.324554 0.481834
C  4.449122 2.252484 0.971033
C  5.694605 2.161402 0.100335
C  2.046356 1.464345 0.930068
C  -3.877258 1.956955 1.769367
C  -4.526085 2.184416 -0.655088
C  -2.453418 3.244717 0.189666
C  3.67983 0.318423 -0.4348
C  1.054232 0.628913 0.413443
C  5.996023 0.709265 -0.195547
C  -3.137467 -0.459701 0.01485
C  -0.366464 0.699633 0.864384
C  2.68683 -0.514011 -0.941475
C  1.384876 -0.346001 -0.528113
C  1.74114 2.54894 1.924872
C  -2.201823 -1.575383 -0.353849
C  -1.958396 -1.863822 -1.690303
C  -1.641477 -2.36057 0.641491
C  -1.148908 -2.93753 -2.04477
C  -0.814937 -3.429556 0.312421
C  -0.579087 -3.701265 -1.030792
C  -0.906099 -3.263594 -3.490188
C  -0.200862 -4.266189 1.395493
H  4.086004 3.282171 0.986133
H  4.703764 2.012339 2.009084
H  5.543881 2.699802 -0.838665
H  6.549164 2.62231 0.598581
H  -3.052914 1.808412 2.464661
H  -4.59285 1.150438 1.906453
H  -4.377129 2.893201 2.023961
H  -5.249332 1.377888 -0.571799
H  -5.048027 3.121667 -0.456422
H  -4.163605 2.22002 -1.684171
H  -2.038772 3.347371 -0.814045
H  -1.633404 3.240601 0.9069
H  -3.048896 4.136628 0.384815
H  6.871709 0.598758 -0.834754
H  6.193665 0.167032 0.737996
H  -0.87805 0.9943 -1.109514
H  2.950757 -1.289832 -1.647677
H  0.620971 -1.014229 -0.907377
H  1.889462 3.536992 1.483186
H  0.725858 2.501957 2.30374
H  2.40416 2.485945 2.788963
H  -2.413018 -1.256281 -2.465878
H  -1.834384 -2.127008 1.681488
H  0.06251 -4.534536 -1.295823
H  -1.824582 -3.591451 -3.979211
H  -0.173161 -4.061086 -3.603504
H  -0.53907 -2.397506 -4.042414
H  0.348641 -3.648165 2.106132
H  0.490922 -5.004213 0.991881
H  -0.96575 -4.803684 1.957843
totalener: -1267.93104931 hartree
nucrepener: 2893.24620134 hartree
electener: -4161.17725065 hartree
oneelecener: -7475.93632686 hartree
twoeener: 3314.75907621 hartree
kineticenergy: 1262.29478672 hartree
xcener: -124.601039038242 hartree
chargesum: 0.0000000
charge: -0.284696 -0.380300 -0.371051 -0.057415 -0.069229 0.158110 0.001093 -0.142529 -0.144531 -0.141330 -0.318343 -0.292226 -0.274158 0.237170 0.204640 0.033370 0.305383 0.150583 -0.236943 -0.132539 -0.310925 0.141423 -0.202849 -0.171110 0.002193 -0.026807 -0.121256 -0.231589 -0.230120 0.085575 0.093807 0.076610 0.073083 0.110258 0.113735 0.082208 0.122498 0.084548 0.079555 0.088289 0.100020 0.091215 0.088821 0.075155 0.158170 0.113798 0.098015 0.099039 0.105803 0.098603 0.101770 0.114690 0.088608 0.105796 0.080108 0.092164 0.104148 0.075512 0.104382
qa: -0.2847 -0.3803 -0.3711 -0.0574 -0.0692 0.1581 0.0011 -0.1425 -0.1445 -0.1413 -0.3183 -0.2922 -0.2742 0.2372 0.2046 0.0334 0.3054 0.1506 -0.2369 -0.1325 -0.3109 0.1414 -0.2028 -0.1711 0.0022 -0.0268 -0.1213 -0.2316 -0.2301 0.0856 0.0938 0.0766 0.0731 0.1103 0.1137 0.0822 0.1225 0.0845 0.0796 0.0883 0.1000 0.0912 0.0888 0.0752 0.1582 0.1138 0.0980 0.0990 0.1058 0.0986 0.1018 0.1147 0.0886 0.1058 0.0801 0.0922 0.1041 0.0755 0.1044
va: 2.1275 2.1252 2.1115 2.9855 3.0881 3.9168 3.5312 3.9475 3.9224 3.8144 3.9083 3.8876 3.9162 3.8976 3.2670 3.9138 4.1336 4.1830 4.1410 3.9434 3.9461 3.6570 3.9122 3.9962 3.7850 3.7915 3.9276 3.9156 3.9199 1.0060 1.0005 1.0113 1.0159 1.0172 1.0224 1.0052 1.0229 1.0082 1.0116 1.0090 1.0069 1.0114 0.9912 0.9961 1.0283 1.0212 1.0109 0.9936 1.0265 0.9984 1.0191 1.0253 1.0160 0.9937 1.0091 0.9964 0.9971 1.0086 0.9952
dispcorr: -0.034767205 hartree
energy: -1267.965816516133
dipole: 1.08716 1.04317 2.13033 10.13347 -9.20410 0.92937 0.41770 -1.29084 -0.87313
magnitude: 2.48282 au
magnitude: 6.31081 debye
