program: Orca
programVersion: 5.0.2
elementType: N N N C C C C C C C C C C C C C C C C C C C H H H H H H H H H H H H H H H H H H H H H H H
charge: 0
multiplicity: 1
keywords: wb97x-d3
keywords: def2-TZVPP
keywords: def2/J RIJCOSX
keywords: DEFGRID2
keywords: scfconv7
keywords: smallprint printgap noloewdin
keywords: NOSOSCF
formula: C19H23N3
InChI: InChI=1/C19H23N3/c1-14-6-8-18(16(3)10-14)20-12-22(5)13-21-19-9-7-15(2)11-17(19)4/h6-13H,1-5H3
45 atoms
N  0.058951 -1.071579 0.475073
N  2.369304 -0.988229 0.545965
N  -2.23585 -0.959185 0.376677
C  3.908413 0.259295 -0.930824
C  -4.528267 -0.406416 0.831076
C  3.564408 -0.300962 0.312551
C  -3.401646 -0.291662 0.000558
C  6.080015 0.931753 -0.021535
C  -5.830394 0.92952 -0.745104
C  5.157991 0.86011 -1.062432
C  -5.711362 0.210699 0.443299
C  4.494311 -0.259527 1.350211
C  -3.513899 0.415158 -1.197129
C  5.725517 0.355797 1.193362
C  -4.709482 1.01677 -1.562908
C  2.997052 0.194813 -2.124279
C  -4.457946 -1.178472 2.113947
C  7.411689 1.59518 -0.216901
C  -7.123559 1.593662 -1.116199
C  1.256356 -0.42663 0.302206
C  -1.10493 -0.407396 0.194592
C  -0.004557 -2.435742 0.963038
H  5.424049 1.28186 -2.026521
H  -6.577484 0.119416 1.090584
H  4.241281 -0.72151 2.296512
H  -2.666224 0.466634 -1.87061
H  6.420788 0.375419 2.024292
H  -4.769688 1.547297 -2.50604
H  2.21572 0.956172 -2.094396
H  3.56168 0.356122 -3.042044
H  2.496787 -0.770977 -2.208641
H  -4.152648 -2.212757 1.946545
H  -3.7370 -0.747785 2.810867
H  -5.42696 -1.194559 2.611409
H  8.042634 1.487444 0.664662
H  7.951496 1.170057 -1.06447
H  7.301971 2.663088 -0.414422
H  -7.177259 2.608104 -0.714627
H  -7.240653 1.669796 -2.197091
H  -7.981857 1.048534 -0.723221
H  1.150702 0.604693 -0.032703
H  -0.967774 0.609709 -0.176723
H  -0.590954 -3.052808 0.286136
H  -0.460625 -2.471242 1.951411
H  0.999724 -2.837072 1.025431
elementType: N C H
totalener: -902.20676975 hartree
nucrepener: 1602.50853905 hartree
electener: -2504.71530881 hartree
oneelecener: -4402.24377056 hartree
twoeener: 1897.52846175 hartree
cpcmener: -0.02766916 hartree
kineticenergy: 898.00717475 hartree
xcener: -90.817407046539 hartree
chargesum: 0.0000000
charge: -0.080774 -0.377946 -0.401734 -0.073106 -0.073131 0.146719 0.146803 -0.020660 -0.018941 -0.181754 -0.153034 -0.224097 -0.211294 -0.176844 -0.194976 -0.247560 -0.248072 -0.210485 -0.208351 0.191872 0.214157 -0.177362 0.124515 0.124048 0.130528 0.144943 0.140418 0.140931 0.106295 0.100197 0.105540 0.094362 0.098888 0.094747 0.090792 0.100338 0.101653 0.101431 0.094852 0.094899 0.127799 0.126247 0.107972 0.114296 0.114877
qa: -0.0808 -0.3779 -0.4017 -0.0731 -0.0731 0.1467 0.1468 -0.0207 -0.0189 -0.1818 -0.1530 -0.2241 -0.2113 -0.1768 -0.1950 -0.2476 -0.2481 -0.2105 -0.2084 0.1919 0.2142 -0.1774 0.1245 0.1240 0.1305 0.1449 0.1404 0.1409 0.1063 0.1002 0.1055 0.0944 0.0989 0.0947 0.0908 0.1003 0.1017 0.1014 0.0949 0.0949 0.1278 0.1262 0.1080 0.1143 0.1149
va: 3.2259 3.0232 3.0145 3.7756 3.7617 3.7802 3.8424 3.7395 3.7301 3.8930 3.9002 4.0410 3.9298 3.9397 3.9384 3.9065 3.9294 3.8996 3.8971 3.9604 3.9490 3.8592 1.0103 1.0086 1.0227 1.0042 1.0007 1.0016 0.9899 1.0046 0.9998 1.0017 0.9966 1.0057 1.0049 0.9952 0.9938 0.9925 1.0010 1.0010 1.0060 1.0095 1.0033 0.9961 1.0312
dispcorr: -0.017283077 hartree
energy: -902.224052832133
dipole: -2.06079 1.97790 -0.08289 3.30143 -2.20087 1.10056 -2.35052 1.78977 -0.56075
magnitude: 1.23796 au
magnitude: 3.14665 debye
