program: Orca
programVersion: 5.0.2
elementType: N N N C C C C C C C C C C C C C C C C C C C H H H H H H H H H H H H H H H H H H H H H H H
charge: 0
multiplicity: 1
keywords: wb97x-d3
keywords: def2-TZVPP
keywords: def2/J RIJCOSX
keywords: DEFGRID2
keywords: scfconv7
keywords: smallprint printgap noloewdin
keywords: NOSOSCF
formula: C19H23N3
InChI: InChI=1/C19H23N3/c1-14-6-8-18(16(3)10-14)20-12-22(5)13-21-19-9-7-15(2)11-17(19)4/h6-13H,1-5H3
45 atoms
N  0.000857 -0.864168 0.658291
N  2.301658 -0.816965 0.519352
N  -2.307684 -0.828867 0.517462
C  4.56398 -0.862281 -0.291112
C  -4.566589 -0.86404 -0.303456
C  3.474033 -0.127285 0.206682
C  -3.478461 -0.135624 0.207074
C  5.908679 1.175376 -0.359246
C  -5.908707 1.175826 -0.357736
C  5.749492 -0.194922 -0.567567
C  -5.750162 -0.192377 -0.578916
C  3.626938 1.240323 0.429193
C  -3.630967 1.230002 0.442995
C  4.824872 1.882258 0.146044
C  -4.826394 1.876249 0.160111
C  4.446171 -2.337166 -0.529289
C  -4.448108 -2.336129 -0.557933
C  7.220648 1.843279 -0.646834
C  -7.219371 1.848538 -0.640031
C  1.177188 -0.272866 0.282122
C  -1.182912 -0.283868 0.285578
C  0.023869 -2.129531 1.367077
H  6.585108 -0.767004 -0.957755
H  -6.584294 -0.759408 -0.979476
H  2.809825 1.809302 0.85702
H  -2.815097 1.793508 0.880356
H  4.915085 2.945271 0.336156
H  -4.916076 2.937516 0.360122
H  4.158588 -2.870344 0.37806
H  3.691173 -2.569434 -1.282157
H  5.392238 -2.75266 -0.873941
H  -4.153632 -2.878479 0.341751
H  -5.395528 -2.74955 -0.901401
H  -3.697441 -2.558769 -1.318072
H  7.989413 1.533327 0.063819
H  7.589559 1.590103 -1.641651
H  7.13908 2.928075 -0.58782
H  -7.968619 1.589875 0.11112
H  -7.120951 2.933611 -0.641113
H  -7.624233 1.548374 -1.607133
H  1.054444 0.678452 -0.237933
H  -1.063191 0.669724 -0.230693
H  -0.932706 -2.284582 1.853229
H  0.80608 -2.114804 2.12057
H  0.210672 -2.959265 0.685612
elementType: N C H
totalener: -902.20905006 hartree
nucrepener: 1594.59585702 hartree
electener: -2496.80490708 hartree
oneelecener: -4386.58974994 hartree
twoeener: 1889.78484287 hartree
cpcmener: -0.02649578 hartree
kineticenergy: 898.01787999 hartree
xcener: -90.819315950464 hartree
chargesum: 0.0000000
charge: -0.093305 -0.400366 -0.398923 -0.067259 -0.067531 0.148339 0.151921 -0.022130 -0.022293 -0.158054 -0.156252 -0.212163 -0.214806 -0.190254 -0.188682 -0.248643 -0.248140 -0.208648 -0.208454 0.211870 0.209341 -0.182382 0.124784 0.124642 0.144116 0.144200 0.141232 0.141082 0.095185 0.099202 0.094203 0.095437 0.094101 0.099559 0.101162 0.099324 0.091201 0.101196 0.091760 0.098471 0.123155 0.118862 0.112912 0.108770 0.122257
qa: -0.0933 -0.4004 -0.3989 -0.0673 -0.0675 0.1483 0.1519 -0.0221 -0.0223 -0.1581 -0.1563 -0.2122 -0.2148 -0.1903 -0.1887 -0.2486 -0.2481 -0.2086 -0.2085 0.2119 0.2093 -0.1824 0.1248 0.1246 0.1441 0.1442 0.1412 0.1411 0.0952 0.0992 0.0942 0.0954 0.0941 0.0996 0.1012 0.0993 0.0912 0.1012 0.0918 0.0985 0.1232 0.1189 0.1129 0.1088 0.1223
va: 3.2478 3.0141 3.0147 3.7535 3.7548 3.8402 3.8312 3.7385 3.7370 3.8990 3.8984 3.9258 3.9308 3.9330 3.9334 3.9308 3.9292 3.8985 3.8982 3.9575 3.9624 3.8592 1.0082 1.0083 1.0044 1.0041 1.0021 1.0019 1.0015 0.9965 1.0056 1.0014 1.0056 0.9963 0.9935 0.9966 1.0046 0.9931 1.0041 0.9974 1.0105 1.0132 1.0217 1.0093 0.9932
dispcorr: -0.016858420 hartree
energy: -902.225908479712
dipole: 0.06163 -0.06333 -0.00169 -1.66124 2.44174 0.78051 -3.41070 2.92385 -0.48686
magnitude: 0.91990 au
magnitude: 2.33821 debye
