program: Orca
programVersion: 5.0.2
elementType: N N N C C C C C C C C C C C C C C C C C C C H H H H H H H H H H H H H H H H H H H H H H H
charge: 0
multiplicity: 1
keywords: wb97x-d3
keywords: def2-TZVPP
keywords: def2/J RIJCOSX
keywords: DEFGRID2
keywords: scfconv7
keywords: smallprint printgap noloewdin
keywords: NOSOSCF
formula: C19H23N3
InChI: InChI=1/C19H23N3/c1-14-6-8-18(16(3)10-14)20-12-22(5)13-21-19-9-7-15(2)11-17(19)4/h6-13H,1-5H3
45 atoms
N  0.085328 -1.545508 -1.0918
N  1.728409 -0.162059 -0.217982
N  -2.143671 -1.153859 -0.731026
C  3.546347 0.624092 1.12797
C  -4.250325 -0.879762 0.379387
C  3.072044 0.190679 -0.11988
C  -3.176086 -0.311214 -0.321104
C  5.76393 0.946598 0.166568
C  -5.325826 1.30581 0.4926
C  4.879425 0.983274 1.243554
C  -5.293841 -0.058251 0.77655
C  3.941158 0.166624 -1.206524
C  -3.201559 1.048094 -0.61975
C  5.270547 0.535764 -1.062654
C  -4.261453 1.845059 -0.215368
C  2.621135 0.673429 2.305707
C  -4.243346 -2.342221 0.706755
C  7.194032 1.368236 0.338965
C  -6.495173 2.147925 0.913435
C  1.393834 -1.181795 -0.886701
C  -0.943359 -0.765736 -0.620578
C  -0.238209 -2.793795 -1.748391
H  5.245493 1.308236 2.212096
H  -6.118212 -0.49864 1.328077
H  3.568118 -0.109268 -2.18579
H  -2.398852 1.483044 -1.203172
H  5.924466 0.514114 -1.926264
H  -4.259509 2.898958 -0.466744
H  2.263277 -0.320454 2.578738
H  3.116846 1.09954 3.177048
H  1.737171 1.273701 2.088486
H  -4.078658 -2.945512 -0.186297
H  -3.443641 -2.592856 1.405855
H  -5.186069 -2.648579 1.158469
H  7.783004 1.162021 -0.553931
H  7.272653 2.437948 0.541703
H  7.667493 0.8478 1.172583
H  -6.270298 3.21135 0.839389
H  -7.369444 1.955973 0.288236
H  -6.786386 1.9441 1.94443
H  2.110686 -1.864777 -1.351047
H  -0.619642 0.166432 -0.158535
H  -0.731332 -3.481657 -1.062216
H  0.67718 -3.255159 -2.112035
H  -0.907608 -2.623226 -2.58958
totalener: -902.19807619 hartree
nucrepener: 1620.20274262 hartree
electener: -2522.40081882 hartree
oneelecener: -4437.27956386 hartree
twoeener: 1914.87874504 hartree
kineticenergy: 898.08094665 hartree
xcener: -90.826469762628 hartree
chargesum: -0.0000000
charge: -0.115693 -0.355062 -0.352999 -0.041766 -0.043846 0.157030 0.163357 0.004299 0.010976 -0.127412 -0.128494 -0.193502 -0.184137 -0.144444 -0.147511 -0.220987 -0.232936 -0.212396 -0.213863 0.170475 0.153890 -0.140521 0.090372 0.088680 0.114423 0.116879 0.103382 0.103653 0.090589 0.077044 0.098085 0.096812 0.090968 0.078036 0.076731 0.097810 0.092223 0.078976 0.097718 0.089364 0.084406 0.129924 0.108045 0.082742 0.108681
qa: -0.1157 -0.3551 -0.3530 -0.0418 -0.0438 0.1570 0.1634 0.0043 0.0110 -0.1274 -0.1285 -0.1935 -0.1841 -0.1444 -0.1475 -0.2210 -0.2329 -0.2124 -0.2139 0.1705 0.1539 -0.1405 0.0904 0.0887 0.1144 0.1169 0.1034 0.1037 0.0906 0.0770 0.0981 0.0968 0.0910 0.0780 0.0767 0.0978 0.0922 0.0790 0.0977 0.0894 0.0844 0.1299 0.1080 0.0827 0.1087
va: 3.2296 3.0362 3.0227 3.8337 3.8289 3.8612 3.8723 3.8041 3.7916 3.9401 3.9448 3.9907 3.9946 4.0067 4.0057 3.9326 3.9344 3.9092 3.9093 4.0043 3.9596 3.9051 1.0141 1.0143 1.0099 1.0100 1.0108 1.0104 0.9992 1.0082 1.0028 1.0035 0.9978 1.0089 1.0086 0.9933 0.9975 1.0074 0.9921 0.9997 1.0223 1.0332 0.9965 1.0054 1.0027
dispcorr: -0.017127283 hartree
energy: -902.215203477293
dipole: -0.57959 1.00501 0.42541 -0.19428 -0.34764 -0.54191 4.90123 -5.15314 -0.25191
magnitude: 0.73356 au
magnitude: 1.86456 debye
