program: Orca
programVersion: 5.0.2
elementType: N N N C C C C C C C C C C C C C C C C C C C H H H H H H H H H H H H H H H H H H H H H H H
charge: 0
multiplicity: 1
keywords: wb97x-d3
keywords: def2-TZVPP
keywords: def2/J RIJCOSX
keywords: DEFGRID2
keywords: scfconv7
keywords: smallprint printgap noloewdin
keywords: NOSOSCF
formula: C19H23N3
InChI: InChI=1/C19H23N3/c1-14-6-8-18(16(3)10-14)20-12-22(5)13-21-19-9-7-15(2)11-17(19)4/h6-13H,1-5H3
45 atoms
N  -0.056801 -1.17597 0.383506
N  2.253069 -1.026458 0.356722
N  -2.355026 -1.143912 0.266553
C  4.488617 -0.837252 -0.489005
C  -3.906089 0.697584 0.735084
C  3.401947 -0.257156 0.183026
C  -3.536887 -0.441506 0.009871
C  5.768357 1.214446 -0.175387
C  -5.967673 0.849807 -0.565304
C  5.640565 -0.086837 -0.659432
C  -5.115913 1.314976 0.425982
C  3.524211 1.033623 0.688222
C  -4.401259 -0.93897 -0.964264
C  4.691991 1.760233 0.507499
C  -5.589613 -0.298627 -1.255949
C  4.382149 -2.233658 -1.021803
C  -3.061381 1.237399 1.856159
C  7.040923 1.982519 -0.383301
C  -7.263319 1.542988 -0.872419
C  1.11873 -0.506078 0.161502
C  -1.247479 -0.560679 0.100598
C  -0.06777 -2.529469 0.899673
H  6.476258 -0.534332 -1.187619
H  -5.403157 2.194772 0.99232
H  2.711473 1.463094 1.262054
H  -4.120245 -1.840153 -1.493902
H  4.764874 2.760096 0.918302
H  -6.236103 -0.701867 -2.026753
H  4.07893 -2.93172 -0.241056
H  3.633598 -2.305528 -1.812561
H  5.332412 -2.571586 -1.433002
H  -2.624214 0.437376 2.453793
H  -2.239163 1.862252 1.501708
H  -3.660583 1.856232 2.522882
H  7.898623 1.458372 0.041253
H  7.248178 2.131263 -1.444422
H  6.995704 2.966499 0.081915
H  -7.395143 2.434251 -0.260227
H  -7.313169 1.852559 -1.917593
H  -8.11878 0.890566 -0.689223
H  0.977779 0.514248 -0.208373
H  -1.143549 0.458566 -0.283084
H  -0.43953 -3.22223 0.145838
H  -0.722103 -2.590747 1.766842
H  0.945523 -2.80062 1.174975
totalener: -902.19732912 hartree
nucrepener: 1606.04626743 hartree
electener: -2508.24359655 hartree
oneelecener: -4408.60449594 hartree
twoeener: 1900.36089939 hartree
kineticenergy: 898.08210561 hartree
xcener: -90.826025046085 hartree
chargesum: -0.0000000
charge: -0.081670 -0.352114 -0.324166 -0.043190 -0.069836 0.156028 0.146218 0.002057 0.013411 -0.126449 -0.137833 -0.195618 -0.180926 -0.139375 -0.145240 -0.224645 -0.237112 -0.212476 -0.214330 0.175613 0.159302 -0.161501 0.091038 0.087843 0.117475 0.107583 0.103576 0.107498 0.097735 0.090549 0.077859 0.105027 0.083863 0.089401 0.095158 0.095755 0.076361 0.076546 0.094312 0.096136 0.079874 0.089608 0.105709 0.105267 0.119677
qa: -0.0817 -0.3521 -0.3242 -0.0432 -0.0698 0.1560 0.1462 0.0021 0.0134 -0.1264 -0.1378 -0.1956 -0.1809 -0.1394 -0.1452 -0.2246 -0.2371 -0.2125 -0.2143 0.1756 0.1593 -0.1615 0.0910 0.0878 0.1175 0.1076 0.1036 0.1075 0.0977 0.0905 0.0779 0.1050 0.0839 0.0894 0.0952 0.0958 0.0764 0.0765 0.0943 0.0961 0.0799 0.0896 0.1057 0.1053 0.1197
va: 3.2157 3.0416 3.0408 3.8361 3.8165 3.8714 3.8808 3.8101 3.7822 3.9366 3.9588 3.9927 4.0794 4.0010 3.9845 3.9340 3.9086 3.9091 3.9054 3.9907 3.9911 3.8636 1.0140 1.0172 1.0087 1.0257 1.0109 1.0067 1.0033 0.9989 1.0081 1.0017 0.9911 1.0089 0.9957 0.9948 1.0089 1.0097 0.9961 0.9949 1.0283 1.0188 1.0022 1.0060 1.0221
dispcorr: -0.017370650 hartree
energy: -902.214699769093
dipole: 1.67461 -1.63106 0.04355 4.09646 -3.55173 0.54472 -0.42557 0.26163 -0.16395
magnitude: 0.57053 au
magnitude: 1.45016 debye
