program: Orca
programVersion: 5.0.2
elementType: F F F F F F N N N N C C C C C C C C C C C C C C C C C C C C C C C C C H H H H H H H H H H H H H H H H H H H H H H H H
charge: 0
multiplicity: 1
keywords: wb97x-d3
keywords: def2-TZVPP
keywords: def2/J RIJCOSX
keywords: DEFGRID2
keywords: scfconv7
keywords: smallprint printgap noloewdin
keywords: NOSOSCF
formula: C25H24F6N4
InChI: InChI=1/C25H24F6N4/c1-23(2)15-32-22(33-16-23)35-34-21(13-7-17-3-9-19(10-4-17)24(26,27)28)14-8-18-5-11-20(12-6-18)25(29,30)31/h3-14,32,35H,15-16H2,1-2H3
59 atoms
F  -6.739185 -4.999402 -0.978276
F  -5.547681 -6.378797 0.155706
F  -6.729966 -4.897189 1.170103
F  8.369269 -0.460201 -0.716098
F  8.04006 -1.152311 1.292371
F  7.651543 -2.457918 -0.365681
N  -0.326011 4.631189 -0.098006
N  -2.661155 4.610447 -0.436935
N  -1.528397 2.654866 -0.177422
N  -0.391661 2.000462 -0.044787
C  -1.471071 6.760987 0.117514
C  -0.206576 6.047867 -0.350789
C  -2.657588 6.053551 -0.543554
C  -1.422525 8.214277 -0.334273
C  -1.593603 6.699583 1.639301
C  -1.530138 4.039595 -0.255098
C  -0.340233 0.713337 0.044694
C  -1.519193 -0.143405 0.116712
C  0.994509 0.113601 0.115513
C  -1.527141 -1.444063 -0.206131
C  2.130394 0.756029 -0.188864
C  -2.675983 -2.339272 -0.106058
C  3.484153 0.219389 -0.093344
C  -2.582508 -3.610133 -0.677159
C  3.787125 -1.070321 0.360452
C  -3.864181 -1.994258 0.545321
C  4.544749 1.03935 -0.484148
C  -4.803793 -4.149302 0.046802
C  6.134754 -0.692975 -0.013218
C  -3.633058 -4.507679 -0.608322
C  5.091981 -1.521416 0.39884
C  -4.916586 -2.885965 0.619034
C  5.855193 0.595077 -0.445994
C  -5.95056 -5.104228 0.102868
C  7.543929 -1.187295 0.04543
H  -0.046761 6.247157 -1.417467
H  0.669034 6.423823 0.180509
H  -2.692916 6.339734 -1.602321
H  -3.585515 6.437862 -0.110051
H  -0.585056 8.743215 0.125294
H  -2.337464 8.740923 -0.05641
H  -1.311305 8.291791 -1.417768
H  -0.72588 7.15506 2.121061
H  -1.681782 5.680096 2.015531
H  -2.479135 7.245354 1.971176
H  0.497143 4.052555 -0.132047
H  -2.420516 2.19309 -0.310229
H  -2.438784 0.312642 0.468634
H  1.030855 -0.914858 0.454616
H  -0.626617 -1.903944 -0.599446
H  2.073498 1.778393 -0.548039
H  -1.671064 -3.901656 -1.1835
H  3.001004 -1.738729 0.685644
H  -3.976487 -1.027499 1.017288
H  4.340226 2.044396 -0.830531
H  -3.520686 -5.482264 -1.064033
H  5.286644 -2.526111 0.751223
H  -5.817931 -2.58535 1.135745
H  6.642177 1.265977 -0.761192
elementType: F N C H
totalener: -1785.38649454 hartree
nucrepener: 3340.03116395 hartree
electener: -5125.41765849 hartree
oneelecener: -9085.85006831 hartree
twoeener: 3960.43240983 hartree
cpcmener: -0.03925628 hartree
kineticenergy: 1778.37372518 hartree
xcener: -163.506278676635 hartree
chargesum: -0.0000000
charge: -0.184823 -0.184494 -0.184208 -0.183600 -0.185401 -0.185880 -0.255643 -0.497660 -0.017974 -0.234419 0.219086 -0.096988 -0.063469 -0.339503 -0.349184 0.270172 0.163719 -0.101468 -0.185195 -0.078841 -0.046955 0.029920 0.021481 -0.150186 -0.187758 -0.187226 -0.166167 -0.033688 -0.039698 -0.161337 -0.173378 -0.157808 -0.147356 0.554373 0.554529 0.102046 0.104366 0.085352 0.081485 0.097729 0.097938 0.092152 0.095835 0.097286 0.096728 0.167839 0.159413 0.115941 0.132674 0.123957 0.118258 0.148251 0.148423 0.147485 0.146257 0.151955 0.150975 0.152089 0.152599
qa: -0.1848 -0.1845 -0.1842 -0.1836 -0.1854 -0.1859 -0.2556 -0.4977 -0.0180 -0.2344 0.2191 -0.0970 -0.0635 -0.3395 -0.3492 0.2702 0.1637 -0.1015 -0.1852 -0.0788 -0.0470 0.0299 0.0215 -0.1502 -0.1878 -0.1872 -0.1662 -0.0337 -0.0397 -0.1613 -0.1734 -0.1578 -0.1474 0.5544 0.5545 0.1020 0.1044 0.0854 0.0815 0.0977 0.0979 0.0922 0.0958 0.0973 0.0967 0.1678 0.1594 0.1159 0.1327 0.1240 0.1183 0.1483 0.1484 0.1475 0.1463 0.1520 0.1510 0.1521 0.1526
va: 1.1008 1.1144 1.1158 1.1167 1.1011 1.1111 3.1385 2.9543 3.1384 2.9914 3.6925 3.9201 3.9930 3.9240 3.9478 4.3560 3.9801 3.8754 3.9372 3.8726 3.8722 3.7840 3.7948 3.9654 3.9756 3.9920 3.9757 3.6532 3.6496 4.0029 4.0340 4.0051 3.9761 4.4293 4.4326 1.0071 1.0024 1.0078 1.0000 1.0033 1.0039 1.0079 1.0054 1.0026 1.0055 1.0319 1.0441 1.0205 1.0078 1.0115 1.0287 1.0041 1.0072 1.0057 1.0055 1.0090 1.0099 1.0098 1.0087
dispcorr: -0.025203412 hartree
energy: -1785.411697948949
dipole: -16.34924 16.83800 0.48876 77.95201 -76.84386 1.10815 0.34999 -0.52311 -0.17312
magnitude: 1.22346 au
magnitude: 3.10978 debye
