program: Orca
programVersion: 5.0.2
elementType: F F F F F F N N N N C C C C C C C C C C C C C C C C C C C C C C C C C H H H H H H H H H H H H H H H H H H H H H H H H
charge: 0
multiplicity: 1
keywords: wb97x-d3
keywords: def2-TZVPP
keywords: def2/J RIJCOSX
keywords: DEFGRID2
keywords: scfconv7
keywords: smallprint printgap noloewdin
keywords: NOSOSCF
formula: C25H24F6N4
InChI: InChI=1/C25H24F6N4/c1-23(2)15-32-22(33-16-23)35-34-21(13-7-17-3-9-19(10-4-17)24(26,27)28)14-8-18-5-11-20(12-6-18)25(29,30)31/h3-14,32,35H,15-16H2,1-2H3
59 atoms
F  -5.171966 -6.042703 -0.726349
F  -4.877365 -5.810895 1.388805
F  -6.420632 -4.693321 0.391478
F  7.564685 -2.903959 -0.121487
F  8.026234 -0.959775 -0.914677
F  7.924632 -1.259046 1.212374
N  -0.756573 5.154946 -0.313037
N  -3.082973 4.79265 -0.300605
N  -1.660581 3.023648 -0.188753
N  -0.436381 2.535165 -0.211164
C  -2.158463 7.103543 0.079149
C  -0.87091 6.574756 -0.550929
C  -3.305183 6.215266 -0.420099
C  -2.388986 8.538581 -0.374464
C  -2.06288 7.056552 1.603276
C  -1.870025 4.391313 -0.286434
C  -0.213307 1.267757 -0.097922
C  -1.275633 0.28077 0.127071
C  1.195998 0.91335 -0.157535
C  -1.332368 -0.907331 -0.486884
C  1.74587 -0.267678 0.159446
C  -2.343736 -1.945429 -0.287296
C  3.173382 -0.570223 0.10281
C  -2.307434 -3.073805 -1.106623
C  3.625865 -1.789315 0.615783
C  -3.336884 -1.878193 0.695787
C  4.121532 0.298165 -0.448693
C  -4.195668 -4.024655 0.025982
C  5.89247 -1.254013 0.036058
C  -3.221288 -4.105304 -0.957475
C  4.966633 -2.130439 0.588254
C  -4.24931 -2.902441 0.851199
C  5.461295 -0.035455 -0.479038
C  -5.164046 -5.14158 0.260656
C  7.346536 -1.59457 0.047591
H  -0.86818 6.796463 -1.625874
H  0.00108 7.070974 -0.11962
H  -3.514186 6.465265 -1.469383
H  -4.218555 6.472635 0.126072
H  -3.329353 8.928711 0.020962
H  -2.433073 8.613035 -1.463441
H  -1.590081 9.199207 -0.029853
H  -1.240401 7.679849 1.961952
H  -1.898827 6.04929 1.987172
H  -2.981441 7.432111 2.059431
H  0.137185 4.701802 -0.40958
H  -2.49211 2.442204 -0.179037
H  -2.053888 0.565449 0.831862
H  1.830268 1.74115 -0.457181
H  -0.568327 -1.154379 -1.217527
H  1.116768 -1.079677 0.507335
H  -1.548883 -3.150301 -1.875923
H  2.913894 -2.483405 1.045442
H  -3.399616 -1.026991 1.360723
H  3.820454 1.246965 -0.871894
H  -3.152081 -4.96257 -1.613055
H  5.272957 -3.084311 0.997564
H  -5.000915 -2.817985 1.62584
H  6.161202 0.663945 -0.916391
elementType: F N C H
totalener: -1785.40187257 hartree
nucrepener: 3349.01675735 hartree
electener: -5134.41862992 hartree
oneelecener: -9103.82080868 hartree
twoeener: 3969.40217876 hartree
cpcmener: -0.03305386 hartree
kineticenergy: 1778.33207295 hartree
xcener: -163.496788269730 hartree
chargesum: 0.0000000
charge: -0.181583 -0.183693 -0.184823 -0.184047 -0.183835 -0.183888 -0.247178 -0.488277 -0.015155 -0.237667 0.204858 -0.094306 -0.058724 -0.336350 -0.344251 0.268178 0.168680 -0.130827 -0.122758 -0.116539 -0.102370 0.058504 0.048474 -0.160216 -0.152091 -0.185200 -0.207930 -0.044010 -0.038021 -0.135283 -0.165837 -0.170492 -0.153973 0.556360 0.551230 0.100654 0.102414 0.084195 0.081035 0.097060 0.091172 0.096329 0.094284 0.099122 0.095772 0.158792 0.160574 0.126310 0.111747 0.138068 0.138145 0.144744 0.142776 0.145962 0.144190 0.152494 0.149686 0.149359 0.148155
qa: -0.1816 -0.1837 -0.1848 -0.1840 -0.1838 -0.1839 -0.2472 -0.4883 -0.0152 -0.2377 0.2049 -0.0943 -0.0587 -0.3364 -0.3443 0.2682 0.1687 -0.1308 -0.1228 -0.1165 -0.1024 0.0585 0.0485 -0.1602 -0.1521 -0.1852 -0.2079 -0.0440 -0.0380 -0.1353 -0.1658 -0.1705 -0.1540 0.5564 0.5512 0.1007 0.1024 0.0842 0.0810 0.0971 0.0912 0.0963 0.0943 0.0991 0.0958 0.1588 0.1606 0.1263 0.1117 0.1381 0.1381 0.1447 0.1428 0.1460 0.1442 0.1525 0.1497 0.1494 0.1482
va: 1.1215 1.1059 1.1129 1.1147 1.1163 1.1017 3.1345 2.9587 3.1195 2.9915 3.7160 3.9171 3.9942 3.9258 3.9465 4.3560 3.9896 3.8320 3.9010 3.8583 3.8504 3.7388 3.7904 3.9822 3.9662 3.9898 4.0135 3.6762 3.6619 3.9644 4.0156 4.0399 4.0041 4.4319 4.4342 1.0063 1.0018 1.0073 1.0003 1.0042 1.0082 1.0036 1.0057 1.0024 1.0059 1.0403 1.0429 1.0138 1.0343 1.0068 1.0027 1.0061 1.0062 1.0065 1.0090 1.0078 1.0097 1.0102 1.0114
dispcorr: -0.025433927 hartree
energy: -1785.427306494115
dipole: -24.36091 24.57123 0.21032 82.21118 -80.98474 1.22645 -1.02147 0.67100 -0.35047
magnitude: 1.29276 au
magnitude: 3.28594 debye
