program: Orca
programVersion: 5.0.2
elementType: F F F O O O O O N N C C C C C C C C C C C C C C C C C C C C H H H H H H H H H H H H H H H H H H H H H
charge: 0
multiplicity: 1
keywords: wb97x-d3
keywords: def2-TZVPP
keywords: def2/J RIJCOSX
keywords: DEFGRID2
keywords: scfconv7
keywords: smallprint printgap noloewdin
keywords: NOSOSCF
formula: C20H21F3N2O5
InChI: InChI=1/C20H21F3N2O5/c1-12(2)30-19-24-16(20(21,22)23)9-17(25-19)29-10-13-7-5-6-8-14(13)15(11-27-3)18(26)28-4/h5-9,11-12H,10H2,1-4H3
51 atoms
F  -3.863658 -2.2804 0.50133
F  -3.702702 -0.953086 2.184796
F  -4.90637 -0.402484 0.486945
O  -0.036602 2.070246 0.753525
O  -1.073095 -0.50141 -2.859494
O  0.300674 -1.666609 2.395989
O  2.676045 1.566729 2.670611
O  0.70135 -1.894661 0.211809
N  -0.582428 0.868345 -1.103415
N  -2.355512 -0.684923 -1.051043
C  2.095903 1.597257 -0.459762
C  2.399979 0.371034 0.142298
C  1.095772 2.59872 0.064746
C  2.772682 1.965737 -1.621818
C  0.192189 -0.160158 -3.480021
C  3.353989 -0.454718 -0.45513
C  1.733219 -0.114065 1.374625
C  3.729408 1.145236 -2.194663
C  4.018391 -0.07966 -1.610233
C  -0.805079 1.180573 0.151577
C  0.103031 1.17729 -4.18374
C  0.508715 -1.293182 -4.431156
C  -1.333972 -0.082835 -1.634861
C  -1.834342 0.592898 0.898869
C  -2.582043 -0.326087 0.206934
C  0.878665 -1.29725 1.255556
C  1.902414 0.498651 2.560607
C  -3.767285 -0.999838 0.853232
C  -0.546897 -2.813268 2.362808
C  2.772542 2.151238 3.968693
H  1.564598 3.256158 0.797107
H  0.756237 3.229208 -0.759821
H  2.530322 2.909816 -2.095669
H  0.957723 -0.120695 -2.701065
H  3.587074 -1.405959 0.007056
H  4.236108 1.45609 -3.098961
H  4.755767 -0.73858 -2.049366
H  -0.656594 1.15962 -4.967139
H  1.061137 1.401347 -4.653717
H  -0.124874 1.990403 -3.496324
H  -0.236782 -1.375453 -5.223668
H  0.571039 -2.248397 -3.90936
H  1.475074 -1.109548 -4.900327
H  -2.00699 0.859645 1.93057
H  1.418456 0.148498 3.467835
H  -0.996245 -2.881273 3.349504
H  -1.333992 -2.719916 1.616025
H  0.024068 -3.721119 2.166705
H  3.149747 1.431206 4.695841
H  1.805709 2.531848 4.299363
H  3.473421 2.97749 3.888924
elementType: F O N C H
totalener: -1560.12531765 hartree
nucrepener: 3299.36241957 hartree
electener: -4859.48773722 hartree
oneelecener: -8704.14535055 hartree
twoeener: 3844.65761333 hartree
cpcmener: -0.04696821 hartree
kineticenergy: 1553.98517740 hartree
xcener: -142.342178738584 hartree
chargesum: -0.0000000
charge: -0.172506 -0.177323 -0.173789 -0.297767 -0.313605 -0.298325 -0.294090 -0.508909 -0.368454 -0.362342 -0.051085 0.081903 0.079763 -0.169539 0.255285 -0.199912 -0.146242 -0.171673 -0.164257 0.386487 -0.299584 -0.263431 0.409129 -0.245465 0.092777 0.443195 0.223049 0.520471 -0.136753 -0.128544 0.131314 0.124448 0.140468 0.004971 0.145089 0.159843 0.158704 0.104746 0.101608 0.099395 0.095933 0.098471 0.092904 0.142323 0.120154 0.128560 0.101086 0.129774 0.124338 0.123833 0.123571
qa: -0.1725 -0.1773 -0.1738 -0.2978 -0.3136 -0.2983 -0.2941 -0.5089 -0.3685 -0.3623 -0.0511 0.0819 0.0798 -0.1695 0.2553 -0.1999 -0.1462 -0.1717 -0.1643 0.3865 -0.2996 -0.2634 0.4091 -0.2455 0.0928 0.4432 0.2230 0.5205 -0.1368 -0.1285 0.1313 0.1244 0.1405 0.0050 0.1451 0.1598 0.1587 0.1047 0.1016 0.0994 0.0959 0.0985 0.0929 0.1423 0.1202 0.1286 0.1011 0.1298 0.1243 0.1238 0.1236
va: 1.1313 1.1246 1.1281 2.1233 2.1083 2.0865 2.1243 1.9806 2.9303 2.9881 3.6189 3.3587 3.7378 3.8573 3.7605 3.9586 3.5281 3.8712 3.8920 4.0357 3.9024 3.9295 4.3102 3.9272 3.9389 4.1134 3.9901 4.4728 3.8724 3.8528 0.9972 1.0049 0.9993 1.0365 1.0074 0.9903 0.9911 1.0089 1.0034 1.0134 1.0067 1.0085 1.0054 1.0210 1.0211 0.9937 1.0006 0.9948 0.9864 0.9857 0.9942
dispcorr: -0.033441877 hartree
energy: -1560.158759528426
dipole: 36.39463 -33.90717 2.48746 9.89063 -7.46052 2.43011 -13.59403 15.84817 2.25414
magnitude: 4.14416 au
magnitude: 10.53362 debye
