program: Orca
programVersion: 5.0.2
elementType: F F F O O O O O N N C C C C C C C C C C C C C C C C C C C C H H H H H H H H H H H H H H H H H H H H H
charge: 0
multiplicity: 1
keywords: wb97x-d3
keywords: def2-TZVPP
keywords: def2/J RIJCOSX
keywords: DEFGRID2
keywords: scfconv7
keywords: smallprint printgap noloewdin
keywords: NOSOSCF
formula: C20H21F3N2O5
InChI: InChI=1/C20H21F3N2O5/c1-12(2)30-19-24-16(20(21,22)23)9-17(25-19)29-10-13-7-5-6-8-14(13)15(11-27-3)18(26)28-4/h5-9,11-12H,10H2,1-4H3
51 atoms
F  -3.041936 -3.315507 -0.354976
F  -3.728545 -1.87924 1.090629
F  -4.455463 -1.799795 -0.929421
O  1.064327 -0.9171 -1.744976
O  -1.782304 2.340569 -0.540201
O  0.012759 -0.591828 2.068383
O  2.232824 2.410905 0.579375
O  1.561804 -2.116971 1.553834
N  -0.426102 0.73935 -1.22279
N  -2.555488 0.189718 -0.3711
C  3.295977 -0.281539 -1.106784
C  3.220611 -0.225901 0.290684
C  2.112162 0.042788 -1.971521
C  4.498848 -0.632465 -1.710839
C  -2.988988 2.866578 0.055175
C  4.348206 -0.537509 1.043666
C  1.960303 0.134733 0.984258
C  5.621648 -0.928131 -0.951204
C  5.544547 -0.884473 0.432092
C  -0.132211 -0.531083 -1.338381
C  -4.054402 3.039296 -1.006896
C  -2.59177 4.177047 0.699391
C  -1.613381 1.043511 -0.708334
C  -1.057321 -1.547243 -1.031963
C  -2.255629 -1.096015 -0.556486
C  1.18352 -0.962354 1.556327
C  1.534965 1.407319 1.085832
C  -3.372413 -2.036802 -0.186039
C  -0.788545 -1.603608 2.67596
C  1.659206 3.710368 0.724789
H  1.748541 1.052061 -1.792185
H  2.38295 -0.031881 -3.024828
H  4.556252 -0.677536 -2.791671
H  -3.335088 2.17324 0.823425
H  4.289547 -0.498788 2.124245
H  6.548595 -1.198532 -1.439469
H  6.411066 -1.119847 1.035863
H  -3.72753 3.735337 -1.780825
H  -4.959374 3.443429 -0.553057
H  -4.317136 2.093547 -1.480186
H  -2.228323 4.892198 -0.040144
H  -1.818329 4.033859 1.455027
H  -3.459071 4.616378 1.191442
H  -0.809674 -2.590698 -1.155275
H  0.611334 1.66503 1.596546
H  -1.029193 -2.403642 1.97687
H  -0.293857 -2.027044 3.550262
H  -1.702441 -1.10886 2.990124
H  1.464569 3.938207 1.773297
H  0.73346 3.792007 0.154138
H  2.384166 4.418945 0.33428
elementType: F O N C H
totalener: -1560.12951441 hartree
nucrepener: 3237.95266055 hartree
electener: -4798.08217496 hartree
oneelecener: -8580.21089981 hartree
twoeener: 3782.12872485 hartree
cpcmener: -0.04291151 hartree
kineticenergy: 1554.00665911 hartree
xcener: -142.342150654043 hartree
chargesum: 0.0000000
charge: -0.176821 -0.173037 -0.173492 -0.292489 -0.311101 -0.296742 -0.292228 -0.511942 -0.374585 -0.397692 -0.149636 0.038736 0.029901 -0.091629 0.178033 -0.212537 -0.128607 -0.161880 -0.157972 0.438601 -0.274635 -0.270305 0.446697 -0.246373 0.073784 0.500634 0.231050 0.516457 -0.138299 -0.122223 0.131398 0.114829 0.146267 0.066463 0.144586 0.161727 0.159850 0.090938 0.100350 0.093429 0.092897 0.097864 0.102819 0.144087 0.122690 0.105005 0.135925 0.127492 0.123494 0.109574 0.128647
qa: -0.1768 -0.1730 -0.1735 -0.2925 -0.3111 -0.2967 -0.2922 -0.5119 -0.3746 -0.3977 -0.1496 0.0387 0.0299 -0.0916 0.1780 -0.2125 -0.1286 -0.1619 -0.1580 0.4386 -0.2746 -0.2703 0.4467 -0.2464 0.0738 0.5006 0.2311 0.5165 -0.1383 -0.1222 0.1314 0.1148 0.1463 0.0665 0.1446 0.1617 0.1599 0.0909 0.1003 0.0934 0.0929 0.0979 0.1028 0.1441 0.1227 0.1050 0.1359 0.1275 0.1235 0.1096 0.1286
va: 1.1286 1.1273 1.1328 2.1374 2.1057 2.0804 2.1043 1.9899 2.9459 2.9708 3.8308 3.4642 3.8161 3.8724 3.7925 3.9883 3.4036 3.9042 3.9012 3.9744 3.9195 3.9124 4.2112 3.8943 3.9329 4.1170 3.9575 4.4774 3.8529 3.8474 1.0233 1.0059 1.0012 1.0263 1.0082 0.9891 0.9908 1.0066 1.0050 1.0159 1.0050 1.0062 1.0071 1.0218 1.0202 1.0010 0.9973 0.9960 0.9863 0.9963 0.9956
dispcorr: -0.031230105 hartree
energy: -1560.160744511899
dipole: 14.00454 -14.22360 -0.21906 33.41635 -30.51153 2.90482 4.94531 -4.70360 0.24171
magnitude: 2.92308 au
magnitude: 7.42987 debye
