program: Orca
programVersion: 5.0.2
elementType: F F F O O O O O N N C C C C C C C C C C C C C C C C C C C C H H H H H H H H H H H H H H H H H H H H H
charge: 0
multiplicity: 1
keywords: wb97x-d3
keywords: def2-TZVPP
keywords: def2/J RIJCOSX
keywords: DEFGRID2
keywords: scfconv7
keywords: smallprint printgap noloewdin
keywords: NOSOSCF
formula: C20H21F3N2O5
InChI: InChI=1/C20H21F3N2O5/c1-12(2)30-19-24-16(20(21,22)23)9-17(25-19)29-10-13-7-5-6-8-14(13)15(11-27-3)18(26)28-4/h5-9,11-12H,10H2,1-4H3
51 atoms
F  -4.186935 -2.551464 -1.024136
F  -2.896142 -3.254865 0.550263
F  -4.321003 -1.694152 0.942981
O  0.860993 -0.786216 -1.570737
O  -2.389774 2.272923 -0.577756
O  1.436756 -2.074198 1.438876
O  1.993792 2.50702 0.928421
O  -0.125968 -0.730477 2.303436
N  -0.753223 0.780884 -1.142407
N  -2.847668 0.124084 -0.280779
C  3.065319 -0.07737 -0.960186
C  3.008144 -0.089178 0.438676
C  1.849706 0.236556 -1.781994
C  4.271971 -0.344956 -1.5971
C  -1.545518 3.371717 -0.989028
C  4.1618 -0.372682 1.162676
C  1.747391 0.202463 1.163277
C  5.419521 -0.617776 -0.86595
C  5.363121 -0.633806 0.519004
C  -0.364452 -0.474128 -1.187135
C  -2.006454 4.572377 -0.192473
C  -1.665806 3.583751 -2.484136
C  -1.967472 1.026777 -0.680569
C  -1.213566 -1.52871 -0.829366
C  -2.445802 -1.135583 -0.371219
C  0.917171 -0.878921 1.696237
C  1.322047 1.460449 1.377285
C  -3.469556 -2.164049 0.037307
C  0.733237 -3.219301 1.917852
C  1.547344 3.787503 1.370922
H  1.443996 1.216115 -1.535689
H  2.095296 0.235017 -2.844441
H  4.313598 -0.33913 -2.679554
H  -0.511334 3.13691 -0.729817
H  4.118246 -0.380791 2.244606
H  6.35097 -0.821329 -1.377547
H  6.250639 -0.847852 1.099848
H  -1.929859 4.394616 0.880718
H  -3.038296 4.838005 -0.427905
H  -1.377404 5.428903 -0.43247
H  -1.350968 2.70686 -3.049283
H  -1.028243 4.41487 -2.78581
H  -2.691343 3.827196 -2.765745
H  -0.892379 -2.55825 -0.889129
H  0.403202 1.658183 1.92459
H  0.720456 -3.249697 3.007505
H  -0.289224 -3.254858 1.543934
H  1.278688 -4.081478 1.544248
H  0.464539 3.885958 1.281877
H  2.026048 4.528116 0.736337
H  1.840462 3.958057 2.40747
elementType: F O N C H
totalener: -1560.12836684 hartree
nucrepener: 3230.83514483 hartree
electener: -4790.96351167 hartree
oneelecener: -8565.98981130 hartree
twoeener: 3775.02629962 hartree
cpcmener: -0.04789252 hartree
kineticenergy: 1554.00687245 hartree
xcener: -142.341894775195 hartree
chargesum: 0.0000000
charge: -0.174802 -0.171312 -0.167356 -0.290712 -0.306776 -0.282850 -0.296903 -0.517945 -0.387867 -0.372513 -0.148020 0.013827 0.007219 -0.068297 0.211917 -0.218572 -0.142510 -0.168205 -0.152889 0.401086 -0.279334 -0.284865 0.433300 -0.282612 0.129510 0.522652 0.250713 0.498823 -0.134331 -0.116779 0.137945 0.113218 0.146803 0.041463 0.144632 0.161543 0.159947 0.101006 0.101607 0.099989 0.097570 0.100105 0.095990 0.151187 0.120058 0.124235 0.105164 0.127051 0.105204 0.127708 0.133978
qa: -0.1748 -0.1713 -0.1674 -0.2907 -0.3068 -0.2828 -0.2969 -0.5179 -0.3879 -0.3725 -0.1480 0.0138 0.0072 -0.0683 0.2119 -0.2186 -0.1425 -0.1682 -0.1529 0.4011 -0.2793 -0.2849 0.4333 -0.2826 0.1295 0.5227 0.2507 0.4988 -0.1343 -0.1168 0.1379 0.1132 0.1468 0.0415 0.1446 0.1615 0.1599 0.1010 0.1016 0.1000 0.0976 0.1001 0.0960 0.1512 0.1201 0.1242 0.1052 0.1271 0.1052 0.1277 0.1340
va: 1.1218 1.1270 1.1406 2.1362 2.1059 2.1083 2.1027 1.9812 2.9263 2.9946 3.8302 3.4333 3.8620 3.8509 3.7805 3.9935 3.3794 3.9104 3.8960 4.0270 3.9279 3.9295 4.2624 3.9504 3.9084 4.0835 3.9225 4.5036 3.8742 3.8458 1.0047 1.0077 1.0008 1.0118 1.0083 0.9894 0.9906 1.0017 1.0091 1.0027 1.0119 1.0042 1.0071 1.0125 1.0254 0.9937 0.9931 0.9954 0.9815 0.9915 0.9914
dispcorr: -0.031136539 hartree
energy: -1560.159503381213
dipole: 27.46111 -24.51385 2.94726 33.94660 -31.87867 2.06794 -3.05018 2.15067 -0.89951
magnitude: 3.71104 au
magnitude: 9.43271 debye
