program: Orca
programVersion: 5.0.2
elementType: F F F O O O O O N N C C C C C C C C C C C C C C C C C C C C H H H H H H H H H H H H H H H H H H H H H
charge: 0
multiplicity: 1
keywords: wb97x-d3
keywords: def2-TZVPP
keywords: def2/J RIJCOSX
keywords: DEFGRID2
keywords: scfconv7
keywords: smallprint printgap noloewdin
keywords: NOSOSCF
formula: C20H21F3N2O5
InChI: InChI=1/C20H21F3N2O5/c1-12(2)30-19-24-16(20(21,22)23)9-17(25-19)29-10-13-7-5-6-8-14(13)15(11-27-3)18(26)28-4/h5-9,11-12H,10H2,1-4H3
51 atoms
F  -2.546373 -0.939906 -3.627681
F  -4.339781 -0.833832 -2.443027
F  -3.287595 0.968424 -2.965075
O  0.50514 -1.963543 0.099146
O  -2.536585 1.034711 1.749803
O  2.249783 1.403855 2.192898
O  1.353231 0.433778 -2.255988
O  0.600144 2.532412 1.192398
N  -1.021241 -0.507047 0.998211
N  -2.757582 0.354138 -0.347331
C  2.75238 -1.359481 0.609665
C  2.929672 -0.100964 0.019164
C  1.42762 -1.767694 1.18545
C  3.808904 -2.262086 0.624576
C  -1.982525 0.970973 3.084121
C  4.158158 0.210316 -0.555154
C  1.83685 0.900513 -0.027649
C  5.034199 -1.938124 0.05852
C  5.206205 -0.69991 -0.539596
C  -0.584245 -1.224995 -0.012262
C  -2.68989 -0.113997 3.869092
C  -2.167732 2.346083 3.686182
C  -2.079293 0.260163 0.783414
C  -1.239629 -1.251664 -1.251009
C  -2.320147 -0.415898 -1.337321
C  1.482151 1.695463 1.147956
C  1.137591 1.129438 -1.155132
C  -3.123576 -0.305974 -2.606623
C  1.995132 2.094654 3.415519
C  0.618735 0.816656 -3.418089
H  1.51263 -2.720808 1.707046
H  1.038942 -1.036339 1.891336
H  3.668456 -3.234718 1.080445
H  -0.917907 0.743617 3.01924
H  4.295987 1.181216 -1.014431
H  5.845238 -2.654067 0.077236
H  6.15347 -0.438873 -0.992862
H  -3.758167 0.091929 3.952055
H  -2.278534 -0.162763 4.877431
H  -2.561095 -1.096161 3.413963
H  -1.661044 3.110871 3.097045
H  -1.740716 2.362275 4.688563
H  -3.222987 2.611569 3.768609
H  -0.879369 -1.862169 -2.064888
H  0.349499 1.878411 -1.187112
H  2.717633 1.709864 4.129501
H  2.137731 3.169671 3.306083
H  0.988209 1.898156 3.785037
H  -0.394707 1.129585 -3.166242
H  0.576127 -0.049498 -4.072688
H  1.128311 1.632566 -3.931544
elementType: F O N C H
totalener: -1560.13003714 hartree
nucrepener: 3248.79758305 hartree
electener: -4808.92762019 hartree
oneelecener: -8601.62620441 hartree
twoeener: 3792.69858422 hartree
cpcmener: -0.04533903 hartree
kineticenergy: 1553.99302810 hartree
xcener: -142.340199275416 hartree
chargesum: -0.0000000
charge: -0.176934 -0.173222 -0.174752 -0.287723 -0.306417 -0.286949 -0.290491 -0.523702 -0.379736 -0.377874 -0.165503 0.020165 0.016508 -0.082314 0.189381 -0.215074 -0.098173 -0.169520 -0.152162 0.384310 -0.280300 -0.267031 0.428005 -0.269993 0.127829 0.512144 0.243314 0.519730 -0.137124 -0.118703 0.114666 0.129125 0.146077 0.049192 0.144690 0.161722 0.160648 0.095165 0.099885 0.096848 0.095878 0.097215 0.101069 0.143061 0.126152 0.129542 0.122728 0.113008 0.102430 0.127950 0.135257
qa: -0.1769 -0.1732 -0.1748 -0.2877 -0.3064 -0.2869 -0.2905 -0.5237 -0.3797 -0.3779 -0.1655 0.0202 0.0165 -0.0823 0.1894 -0.2151 -0.0982 -0.1695 -0.1522 0.3843 -0.2803 -0.2670 0.4280 -0.2700 0.1278 0.5121 0.2433 0.5197 -0.1371 -0.1187 0.1147 0.1291 0.1461 0.0492 0.1447 0.1617 0.1606 0.0952 0.0999 0.0968 0.0959 0.0972 0.1011 0.1431 0.1262 0.1295 0.1227 0.1130 0.1024 0.1279 0.1353
va: 1.1271 1.1321 1.1273 2.1306 2.0981 2.1167 2.1025 1.9763 2.9204 3.0094 3.8242 3.4154 3.8656 3.8700 3.8025 3.9826 3.3409 3.9102 3.8956 4.0475 3.9434 3.9169 4.2559 3.9066 3.8981 4.0740 3.9121 4.4856 3.8776 3.8439 1.0070 1.0123 1.0009 1.0162 1.0089 0.9894 0.9906 1.0068 1.0045 1.0097 1.0143 1.0023 1.0098 1.0208 1.0212 0.9967 0.9934 0.9804 0.9982 0.9898 0.9930
dispcorr: -0.032211861 hartree
energy: -1560.162248999611
dipole: 21.78250 -19.48707 2.29544 7.20402 -8.21968 -1.01566 33.04453 -32.18327 0.86126
magnitude: 2.65374 au
magnitude: 6.74528 debye
