program: Orca
programVersion: 5.0.2
elementType: F F F O O O O O N N C C C C C C C C C C C C C C C C C C C C H H H H H H H H H H H H H H H H H H H H H
charge: 0
multiplicity: 1
keywords: wb97x-d3
keywords: def2-TZVPP
keywords: def2/J RIJCOSX
keywords: DEFGRID2
keywords: scfconv7
keywords: smallprint printgap noloewdin
keywords: NOSOSCF
formula: C20H21F3N2O5
InChI: InChI=1/C20H21F3N2O5/c1-12(2)30-19-24-16(20(21,22)23)9-17(25-19)29-10-13-7-5-6-8-14(13)15(11-27-3)18(26)28-4/h5-9,11-12H,10H2,1-4H3
51 atoms
F  -4.797392 -2.439931 -0.67639
F  -4.123404 -1.736716 -2.596045
F  -3.522615 -3.678524 -1.889553
O  0.733147 -2.324962 0.270024
O  -1.891891 1.329243 0.513649
O  1.29201 2.659416 -0.022219
O  3.963528 -0.113414 2.569187
O  1.455531 3.118212 2.156242
N  -0.572037 -0.450244 0.353573
N  -2.770565 -0.516887 -0.49879
C  2.578253 -0.820144 -0.182412
C  2.965765 0.508971 0.01057
C  1.812722 -1.591147 0.858142
C  2.936885 -1.472263 -1.362711
C  -3.163004 2.007698 0.375168
C  3.707162 1.148628 -0.985908
C  2.627138 1.253261 1.245288
C  3.662422 -0.823791 -2.34619
C  4.052853 0.495554 -2.155091
C  -0.400915 -1.703508 0.009062
C  -3.285457 2.611566 -1.008263
C  -3.212533 3.045953 1.473849
C  -1.764406 0.085004 0.096299
C  -1.401105 -2.46154 -0.628664
C  -2.564286 -1.784025 -0.85088
C  1.744248 2.425342 1.203513
C  3.143739 0.916494 2.441187
C  -3.75635 -2.422571 -1.511978
C  0.523823 3.841018 -0.22854
C  4.425085 -0.404754 3.885165
H  2.444617 -2.359109 1.304821
H  1.436831 -0.953666 1.656723
H  2.646687 -2.504686 -1.516256
H  -3.963603 1.281974 0.532053
H  4.022546 2.173737 -0.835477
H  3.930925 -1.34791 -3.254437
H  4.629459 1.011186 -2.912307
H  -2.487165 3.330977 -1.199551
H  -4.23674 3.138539 -1.092451
H  -3.263345 1.851771 -1.789301
H  -4.17476 3.557522 1.442884
H  -2.431649 3.799691 1.359929
H  -3.112405 2.590698 2.459771
H  -1.235421 -3.491234 -0.908083
H  2.898431 1.477444 3.340174
H  -0.385702 3.851145 0.371341
H  1.105671 4.736841 -0.005408
H  0.261028 3.843588 -1.283128
H  4.98603 0.434004 4.301053
H  5.083843 -1.265345 3.8021
H  3.595512 -0.65361 4.548909
elementType: F O N C H
totalener: -1560.13870035 hartree
nucrepener: 3127.33098093 hartree
electener: -4687.46968128 hartree
oneelecener: -8359.70194085 hartree
twoeener: 3672.23225957 hartree
cpcmener: -0.03622139 hartree
kineticenergy: 1553.99882751 hartree
xcener: -142.337105503035 hartree
chargesum: -0.0000000
charge: -0.171913 -0.171733 -0.173804 -0.294401 -0.300663 -0.277688 -0.287418 -0.492134 -0.382329 -0.407091 -0.129683 0.081709 0.109077 -0.155212 0.157017 -0.215352 -0.172391 -0.166836 -0.150424 0.437671 -0.276444 -0.258639 0.439790 -0.263442 0.089634 0.483747 0.237368 0.506815 -0.149495 -0.130167 0.130137 0.120364 0.137660 0.076052 0.138535 0.156908 0.156414 0.088740 0.102531 0.096479 0.096704 0.095979 0.097824 0.148469 0.111360 0.103697 0.130059 0.128580 0.123801 0.122743 0.121395
qa: -0.1719 -0.1717 -0.1738 -0.2944 -0.3007 -0.2777 -0.2874 -0.4921 -0.3823 -0.4071 -0.1297 0.0817 0.1091 -0.1552 0.1570 -0.2154 -0.1724 -0.1668 -0.1504 0.4377 -0.2764 -0.2586 0.4398 -0.2634 0.0896 0.4837 0.2374 0.5068 -0.1495 -0.1302 0.1301 0.1204 0.1377 0.0761 0.1385 0.1569 0.1564 0.0887 0.1025 0.0965 0.0967 0.0960 0.0978 0.1485 0.1114 0.1037 0.1301 0.1286 0.1238 0.1227 0.1214
va: 1.1305 1.1321 1.1319 2.1406 2.1102 2.1011 2.1288 2.0230 2.9757 2.9932 3.7014 3.4546 3.7290 3.9183 3.7849 3.9717 3.4533 3.9174 3.9038 4.0217 3.9191 3.9299 4.2281 3.9648 3.9776 4.1228 3.9600 4.4967 3.8806 3.8577 0.9934 1.0171 1.0122 1.0273 1.0108 0.9910 0.9914 1.0049 1.0058 1.0168 1.0049 0.9951 1.0085 1.0175 1.0285 0.9874 0.9979 0.9923 0.9859 0.9942 0.9859
dispcorr: -0.027384964 hartree
energy: -1560.166085316842
dipole: 22.88840 -21.38589 1.50252 30.53252 -30.78186 -0.24934 14.46272 -13.64371 0.81901
magnitude: 1.72931 au
magnitude: 4.39555 debye
