program: Orca
programVersion: 5.0.2
elementType: F F F O O O O O N N C C C C C C C C C C C C C C C C C C C C H H H H H H H H H H H H H H H H H H H H H
charge: 0
multiplicity: 1
keywords: wb97x-d3
keywords: def2-TZVPP
keywords: def2/J RIJCOSX
keywords: DEFGRID2
keywords: scfconv7
keywords: smallprint printgap noloewdin
keywords: NOSOSCF
formula: C20H21F3N2O5
InChI: InChI=1/C20H21F3N2O5/c1-12(2)30-19-24-16(20(21,22)23)9-17(25-19)29-10-13-7-5-6-8-14(13)15(11-27-3)18(26)28-4/h5-9,11-12H,10H2,1-4H3
51 atoms
F  -4.594854 -2.410682 -1.060716
F  -2.987538 -3.840247 -0.962327
F  -3.687378 -2.879669 0.83186
O  0.752348 -0.737118 -1.889142
O  -2.472976 1.75626 0.17427
O  0.812159 -1.07058 1.616542
O  2.924201 2.912517 0.533967
O  -0.06939 0.814778 2.427997
N  -0.839041 0.557571 -0.877837
N  -2.878906 -0.395995 -0.181256
C  2.881555 -0.128301 -1.003639
C  2.933584 0.1094 0.374414
C  1.725005 0.324935 -1.845425
C  3.907166 -0.848383 -1.61087
C  -1.668124 2.951829 0.073172
C  4.009405 -0.38754 1.106752
C  1.896853 0.899537 1.083345
C  4.975081 -1.335417 -0.874316
C  5.022847 -1.107294 0.493107
C  -0.431925 -0.607624 -1.326391
C  -2.070501 3.831539 1.235748
C  -1.890087 3.610619 -1.272452
C  -2.038103 0.612941 -0.315737
C  -1.231368 -1.758822 -1.246079
C  -2.450682 -1.560172 -0.655531
C  0.784665 0.247722 1.77802
C  1.962821 2.240344 1.143602
C  -3.433211 -2.686453 -0.464888
C  -0.193542 -1.83604 2.276112
C  2.867041 4.331946 0.641899
H  1.275579 1.245196 -1.479405
H  2.040275 0.48482 -2.876468
H  3.867815 -1.026748 -2.679171
H  -0.616766 2.681167 0.174704
H  4.054169 -0.200635 2.172634
H  5.764066 -1.890446 -1.365086
H  5.850895 -1.481924 1.081119
H  -1.474601 4.744543 1.223657
H  -1.893142 3.3337 2.18991
H  -3.12235 4.118116 1.183235
H  -2.937688 3.881308 -1.415857
H  -1.583142 2.965084 -2.095988
H  -1.296592 4.523671 -1.334654
H  -0.886746 -2.711429 -1.619098
H  1.225158 2.815641 1.699231
H  -1.199754 -1.515699 2.007591
H  -0.046851 -2.86361 1.95387
H  -0.08154 -1.783249 3.360102
H  2.913998 4.651383 1.684395
H  1.958755 4.725533 0.181579
H  3.731668 4.723275 0.111879
elementType: F O N C H
totalener: -1560.13700966 hartree
nucrepener: 3232.58784724 hartree
electener: -4792.72485690 hartree
oneelecener: -8569.26495016 hartree
twoeener: 3776.54009326 hartree
cpcmener: -0.03863133 hartree
kineticenergy: 1554.00364797 hartree
xcener: -142.338838364136 hartree
chargesum: -0.0000000
charge: -0.170122 -0.175000 -0.171805 -0.277983 -0.291430 -0.274967 -0.289512 -0.484112 -0.376720 -0.365151 -0.147514 0.069378 0.029954 -0.117139 0.211492 -0.190999 -0.151762 -0.158660 -0.156063 0.366106 -0.250702 -0.284581 0.405241 -0.218088 0.082146 0.479947 0.254365 0.505783 -0.159616 -0.127565 0.128703 0.122683 0.141103 0.017675 0.140895 0.158116 0.157434 0.090234 0.096360 0.098937 0.099300 0.096202 0.096241 0.138505 0.115840 0.112635 0.129318 0.133982 0.119613 0.117165 0.124142
qa: -0.1701 -0.1750 -0.1718 -0.2780 -0.2914 -0.2750 -0.2895 -0.4841 -0.3767 -0.3652 -0.1475 0.0694 0.0300 -0.1171 0.2115 -0.1910 -0.1518 -0.1587 -0.1561 0.3661 -0.2507 -0.2846 0.4052 -0.2181 0.0821 0.4799 0.2544 0.5058 -0.1596 -0.1276 0.1287 0.1227 0.1411 0.0177 0.1409 0.1581 0.1574 0.0902 0.0964 0.0989 0.0993 0.0962 0.0962 0.1385 0.1158 0.1126 0.1293 0.1340 0.1196 0.1172 0.1241
va: 1.1356 1.1300 1.1273 2.1459 2.1197 2.1104 2.1095 2.0204 2.8805 2.9845 3.8251 3.3911 3.8783 3.9059 3.8061 3.9868 3.3542 3.9061 3.9102 4.0793 3.9138 3.9421 4.2836 3.8981 3.9326 4.1323 3.9335 4.5088 3.8730 3.8647 0.9990 0.9954 1.0016 1.0271 1.0081 0.9903 0.9912 1.0054 1.0139 1.0076 1.0074 1.0107 1.0051 1.0204 1.0172 0.9950 0.9927 0.9967 0.9859 0.9845 0.9942
dispcorr: -0.031686129 hartree
energy: -1560.168695792651
dipole: 27.16652 -24.09268 3.07384 37.90396 -35.87702 2.02694 4.73706 -5.59191 -0.85485
magnitude: 3.77992 au
magnitude: 9.60778 debye
