program: Gaussian 09
title: 000055013
version: EM64L-G09RevD.01
frameworkgroup: C1[X(C9H9FS2)]
method: RPBEPBE
basis: SDD
operation: Freq
keyword: #pfreq=noraman
keyword: PBEPBE/SDD
title: #p freq=noraman PBEPBE/SDD
converged: YES YES NO NO
title: Mulliken charges:
elementType: S S F C C C C C C C C C H H H H H H H H H
charge: 0.215798 0.234943 -0.209303 -0.929509 -0.622794 -0.629933 0.639381 -0.457740 -0.458272 0.344065 -0.172336 -0.385656 0.333396 0.277493 0.265134 0.275496 0.268743 0.280104 0.237603 0.234768 0.258618
chargesum: 0.00000
title: Mulliken charges with hydrogens summed into heavy atoms:
elementType: S S F C C C C C C C C C
charge: 0.215798 0.234943 -0.209303 -0.596114 -0.080167 -0.085694 0.639381 -0.177635 -0.220669 0.344065 0.062432 -0.127038
polarizability: 1.78556130e+02 -1.48813863e+01 1.13437649e+02 8.20042693e-01 -2.75343482e+00 9.06748277e+01
1716.lowfreq: -6.7594 -0.0034 -0.0029 -0.0023 7.4646 8.3043 27.6211 37.3892 84.6390
frequency: 27.3627 37.0106 84.6256 132.8792 228.6447 240.2502 254.5366 264.6568 372.5935 399.4168 438.6438 449.0389 502.1493 558.0817 570.1250 623.5236 637.9636 658.0101 678.5760 713.9683 750.6762 795.3329 856.3766 880.6773 900.0126 933.6054 956.7225 971.9456 988.1296 1004.9170 1079.2240 1102.6196 1124.9586 1143.2270 1161.1959 1172.5181 1214.3838 1243.6538 1261.7591 1290.0561 1299.0814 1391.5621 1430.8877 1441.6588 1443.9164 1471.2582 1593.9285 1615.6150 3024.8810 3033.0060 3068.1868 3097.5016 3115.3450 3134.9476 3156.2514 3173.7367 3180.6865
redmass: 6.1602 3.9647 7.6936 10.6618 5.5125 2.1284 5.3224 6.9655 10.6820 7.4906 3.4581 3.0717 8.9963 6.0109 6.6052 6.2089 3.7929 5.2657 3.7974 2.5503 6.5210 1.4379 1.5628 1.6600 1.4138 2.9544 1.6023 1.3348 6.2766 2.3230 1.6000 1.0484 1.7522 1.3586 1.1094 1.1422 1.2779 3.1060 1.2450 1.1845 1.3880 8.1433 1.0881 1.4567 1.7175 2.6045 6.5974 7.1198 1.0552 1.0588 1.0871 1.1077 1.1085 1.0879 1.0932 1.0926 1.0978
irintensity: 0.9877 3.4089 0.9876 1.1425 0.5090 1.2583 0.4997 2.1674 2.5204 0.6933 0.1345 4.2316 5.7944 4.5923 7.5745 3.1901 0.6583 4.6380 3.1363 56.1117 27.2613 31.8939 7.1063 21.2421 0.0267 24.2924 5.6930 0.8396 0.6498 5.2984 6.3442 0.9642 21.0084 1.0741 5.4748 0.6733 9.3842 54.7704 4.0348 17.5981 1.9913 0.4993 16.9201 11.9967 42.7825 24.0725 39.0457 31.1894 15.2104 37.5694 7.5884 0.1585 18.0835 5.9213 15.1330 0.0545 6.2069
temp: 298.150 k
press: 1.00000 atm
elementType: 16 16 9 6 6 6 6 6 6 6 6 6 1 1 1 1 1 1 1 1 1
symmnumber: 1
zpe: 408982.3 jmol-1
zpe.correction: 0.155773 hartree
zpe.thermalcorrener: 0.166964 hartree
zpe.thermalcorrenthalpy: 0.167908 hartree
zpe.thermalcorrgfe: 0.116689 hartree
zpe.sumelectzpe: -1243.442069 hartree
zpe.sumelectthermal: -1243.430878 hartree
zpe.sumelectthermalent: -1243.429934 hartree
zpe.sumelectthermalfe: -1243.481154 hartree
dipole: -2.0660 -1.6313 -0.0679
dipole: 2.6333
quadrupole: -70.6408 -82.2976 -92.6198
quadrupole: -10.4651 1.8708 -0.9729
quadrupole: 11.2120 -0.4449 -10.7671 -10.4651 1.8708 -0.9729
hfenergy: -1243.5978424 hartree
pointgroup: C01 [X(C9H9F1S2)]
dipole: -0.8193449 -0.6314772 -0.0571399 debye
dipolederiv: -0.3633411 0.0451855 0.032904 0.0796637 -0.1901632 -0.0268637 0.0556063 -0.0582687 -0.1810163 -0.2891037 0.0304114 -0.0414683 0.053353 -0.1488511 -0.1044426 -0.02906 -0.043 -0.1894907 -0.4186358 -0.2949217 0.0170655 -0.4694011 -0.9113355 0.0392981 0.0253518 0.0354133 -0.1569455 0.5580809 -0.0825002 0.0130431 -0.0977261 0.200044 0.0590722 -0.0240038 0.0675348 0.3477145 0.0904143 -0.0458146 0.0645652 -0.1479423 0.1671438 -0.0835804 0.1765636 -0.1355002 -0.0183996 0.188491 0.0013572 -0.1112869 0.0606048 0.0942577 0.1034636 -0.2197912 0.0020165 0.0533432 0.1908419 -0.0355842 0.0027805 0.0278277 0.0574772 -0.0006931 -0.0220425 -0.0129011 -0.092135 -0.2364848 -0.2036124 0.0206208 -0.0654948 -0.1617267 0.0080341 -0.0089529 0.0111283 -0.1030515 -0.2248056 0.1162461 -0.0065308 0.010935 0.028499 -0.0068131 0.0067221 -0.0091149 -0.1617777 0.4854174 0.3617633 -0.0334943 0.5248559 1.0383123 -0.0430836 -0.0261892 -0.0453282 0.1023904 0.1003641 -0.0822645 0.0057849 -0.028668 0.096459 -0.0039546 -0.0068593 -0.0073093 -0.1157039 -0.0597787 0.0858337 -0.0004538 -0.0892336 -0.2189795 -0.0050169 0.0028962 0.0012139 -0.1697736 -0.007481 0.0544507 0.0076317 0.0113634 -0.0942439 -0.0012603 -0.0028536 0.0070655 -0.0537838 0.0326024 -0.0383231 -0.0283711 0.0137645 -0.1092817 0.0238962 -0.0636171 0.092462 0.0450729 -0.0706362 0.0465191 0.0765987 0.0698866 0.0832652 -0.0204731 0.0792344 -0.0144718 0.0108692 -0.0498554 -0.0473387 0.0363546 -0.0989651 -0.0531578 -0.0134713 0.1182007 0.0255019 0.045685 -0.0253612 0.054009 -0.0643732 0.0702283 0.063812 0.0537978 -0.0713284 0.0613627 0.0040843 0.0928563 0.0699543 0.0007791 0.0752827 0.0406948 0.0026378 0.0016643 0.0016988 0.1486932 0.0622359 -0.1001348 0.0051645 -0.0744217 -0.0487634 0.0092183 0.0062547 0.0093597 0.1467554 -0.0067687 0.0929095 -0.0015094 0.1026054 -0.033438 0.006681 -0.0013469 0.0071617 0.1576009 -0.0490519 -0.0281456 0.0041954 -0.0285182 0.0999757 0.0035536 0.0035506 0.0039754 0.1798685 unknown
polarizability: 178.2631672|-15.5179159|113.9681056|-0.927063|-1.226299|90.4373339 unknown
InChI: InChI=1S/C9H9FS2/c10-8-3-1-2-7(6-8)9-11-4-5-12-9/h1-3,6,9H,4-5H2
charge 0 multiplicity 1
21 atoms
S  -2.055252 0.040761 1.593712
S  -2.031032 -0.073008 -1.510714
F  2.758945 2.197919 -0.124171
C  -1.212434 -0.773334 0.058373
C  -3.379971 1.009882 0.644463
C  -3.680789 0.270497 -0.661822
C  0.283037 -0.555016 0.02855
C  0.826239 0.753398 -0.034256
C  1.155595 -1.671675 0.063915
C  2.218556 0.896049 -0.061358
C  2.558259 -1.489889 0.035923
C  3.110431 -0.19252 -0.027929
H  -1.450294 -1.846065 0.120021
H  -3.008037 2.028359 0.45257
H  -4.265684 1.04704 1.302037
H  -4.20114 -0.683464 -0.478422
H  -4.268743 0.889436 -1.36159
H  0.174403 1.631114 -0.056997
H  0.73792 -2.683664 0.11226
H  3.22293 -2.359408 0.063824
H  4.190161 -0.019811 -0.04959
