program: Orca
programVersion: 5.0.2
elementType: F F F O O O O O N N C C C C C C C C C C C C C C C C C C C C H H H H H H H H H H H H H H H H H H H H H
charge: 0
multiplicity: 1
keywords: wb97x-d3
keywords: def2-TZVPP
keywords: def2/J RIJCOSX
keywords: DEFGRID2
keywords: scfconv7
keywords: smallprint printgap noloewdin
keywords: NOSOSCF
formula: C20H21F3N2O5
InChI: InChI=1/C20H21F3N2O5/c1-12(2)30-19-24-16(20(21,22)23)9-17(25-19)29-10-13-7-5-6-8-14(13)15(11-27-3)18(26)28-4/h5-9,11-12H,10H2,1-4H3
51 atoms
F  -4.655061 -0.883694 -0.107402
F  -3.696873 -0.250042 -1.927957
F  -3.380088 -2.244804 -1.182554
O  0.603366 -1.462479 1.647098
O  -1.275451 2.587791 1.202341
O  3.227485 -2.736632 0.247819
O  0.560846 0.431875 -1.890074
O  1.644681 -3.448707 -1.158648
N  -0.370361 0.582023 1.450731
N  -2.351655 0.840882 0.196871
C  2.506409 0.095447 1.371498
C  2.634561 -0.063888 -0.01139
C  1.715554 -0.826841 2.262804
C  3.177157 1.139006 1.999413
C  -2.229542 3.507091 0.651209
C  3.433904 0.834093 -0.716759
C  1.926854 -1.112661 -0.780463
C  3.980751 2.013356 1.289972
C  4.108635 1.860799 -0.080947
C  -0.377613 -0.699371 1.198006
C  -1.894402 3.809199 -0.798063
C  -2.163026 4.742685 1.526275
C  -1.355628 1.30335 0.924785
C  -1.3892 -1.325535 0.446819
C  -2.352816 -0.472625 -0.017111
C  2.219283 -2.544492 -0.605083
C  0.978157 -0.811966 -1.680645
C  -3.530801 -0.969788 -0.816976
C  3.60087 -4.083105 0.493705
C  -0.32089 0.619698 -2.979292
H  2.341241 -1.655382 2.595635
H  1.385072 -0.277023 3.14733
H  3.055172 1.277814 3.06733
H  -3.227708 3.065262 0.70857
H  3.532196 0.710253 -1.78743
H  4.491738 2.816639 1.804005
H  4.726564 2.539368 -0.653835
H  -2.003157 2.924864 -1.423661
H  -0.875326 4.186734 -0.89107
H  -2.573641 4.569921 -1.184291
H  -2.390709 4.506408 2.565377
H  -2.889686 5.478816 1.183143
H  -1.174485 5.201832 1.488305
H  -1.371229 -2.386895 0.252567
H  0.498711 -1.60476 -2.251423
H  4.418671 -4.040779 1.208438
H  2.777891 -4.661036 0.915566
H  3.941476 -4.579327 -0.415539
H  0.1922 0.487186 -3.934873
H  -0.690738 1.639523 -2.917176
H  -1.172509 -0.062471 -2.93573
totalener: -1560.11226374 hartree
nucrepener: 3260.01230697 hartree
electener: -4820.12457071 hartree
oneelecener: -8623.21484518 hartree
twoeener: 3803.09027446 hartree
kineticenergy: 1554.08125265 hartree
xcener: -142.350958022190 hartree
chargesum: 0.0000000
charge: -0.160126 -0.167498 -0.171636 -0.271644 -0.255921 -0.274412 -0.255471 -0.396623 -0.315193 -0.360349 -0.069471 0.121010 0.057655 -0.091272 0.157165 -0.178980 -0.222803 -0.142389 -0.126305 0.380959 -0.277520 -0.229862 0.400797 -0.219761 0.002099 0.449487 0.172692 0.519869 -0.147604 -0.143886 0.120169 0.105436 0.097733 0.064735 0.112264 0.121833 0.120910 0.086675 0.096567 0.088027 0.092208 0.077405 0.085688 0.144540 0.122224 0.113805 0.111392 0.114830 0.125314 0.116665 0.098569
qa: -0.1601 -0.1675 -0.1716 -0.2716 -0.2559 -0.2744 -0.2555 -0.3966 -0.3152 -0.3603 -0.0695 0.1210 0.0577 -0.0913 0.1572 -0.1790 -0.2228 -0.1424 -0.1263 0.3810 -0.2775 -0.2299 0.4008 -0.2198 0.0021 0.4495 0.1727 0.5199 -0.1476 -0.1439 0.1202 0.1054 0.0977 0.0647 0.1123 0.1218 0.1209 0.0867 0.0966 0.0880 0.0922 0.0774 0.0857 0.1445 0.1222 0.1138 0.1114 0.1148 0.1253 0.1167 0.0986
va: 1.1517 1.1324 1.1317 2.1445 2.1640 2.1264 2.0927 2.1184 2.9707 2.9597 3.7579 3.4552 3.7933 3.9619 3.8271 4.0114 3.6447 3.9876 3.9652 4.0264 3.9108 3.9287 4.2695 3.8709 4.0081 4.1496 3.9214 4.4629 3.9053 3.8762 0.9863 1.0159 1.0091 1.0244 1.0146 1.0017 1.0019 1.0198 1.0060 1.0109 1.0112 1.0072 1.0085 1.0238 1.0290 0.9938 0.9943 0.9966 0.9929 0.9936 0.9985
dispcorr: -0.030812551 hartree
energy: -1560.143076290622
dipole: 22.93725 -22.30481 0.63245 22.51024 -21.65810 0.85215 3.20233 -3.09048 0.11185
magnitude: 1.06708 au
magnitude: 2.71230 debye
