program: Orca
programVersion: 5.0.2
elementType: F F F O O O O O N N C C C C C C C C C C C C C C C C C C C C H H H H H H H H H H H H H H H H H H H H H
charge: 0
multiplicity: 1
keywords: wb97x-d3
keywords: def2-TZVPP
keywords: def2/J RIJCOSX
keywords: DEFGRID2
keywords: scfconv7
keywords: smallprint printgap noloewdin
keywords: NOSOSCF
formula: C20H21F3N2O5
InChI: InChI=1/C20H21F3N2O5/c1-12(2)30-19-24-16(20(21,22)23)9-17(25-19)29-10-13-7-5-6-8-14(13)15(11-27-3)18(26)28-4/h5-9,11-12H,10H2,1-4H3
51 atoms
F  -4.945323 -0.395905 -0.489217
F  -4.118304 -2.278665 0.144377
F  -4.062997 -0.579963 1.463612
O  0.65074 -1.72839 -1.129313
O  -1.199351 2.417081 -1.341443
O  2.876506 -2.484245 1.056349
O  -0.072975 1.054258 1.751814
O  1.044902 -2.850414 2.283954
N  -0.281229 0.333593 -1.355843
N  -2.492661 0.7422 -0.64932
C  2.48591 -0.058149 -0.846575
C  2.323207 0.151249 0.526221
C  1.869935 -1.194521 -1.624722
C  3.300279 0.805782 -1.571467
C  0.099358 2.972382 -1.627554
C  2.974661 1.231048 1.120115
C  1.447518 -0.684838 1.376913
C  3.952876 1.866389 -0.966731
C  3.785496 2.083481 0.391219
C  -0.393338 -0.92471 -1.00857
C  0.044473 4.411754 -1.158023
C  0.417184 2.85715 -3.10608
C  -1.318175 1.126018 -1.116276
C  -1.580815 -1.46058 -0.495602
C  -2.601815 -0.547712 -0.368087
C  1.733902 -2.105051 1.633802
C  0.339776 -0.190443 1.953508
C  -3.948962 -0.955507 0.182974
C  3.250359 -3.843292 1.220176
C  -1.210403 1.478632 2.483545
H  1.732071 -0.877091 -2.66226
H  2.546864 -2.04925 -1.628665
H  3.414556 0.653635 -2.638874
H  0.852592 2.428862 -1.051411
H  2.846061 1.39263 2.182548
H  4.581462 2.521617 -1.555363
H  4.282737 2.909702 0.881823
H  -0.704395 4.984452 -1.706287
H  1.01339 4.88578 -1.315125
H  -0.186458 4.472165 -0.09471
H  1.389786 3.308142 -3.306504
H  -0.3265 3.376746 -3.712102
H  0.464137 1.817271 -3.425062
H  -1.661851 -2.50238 -0.226909
H  -0.273965 -0.827063 2.587548
H  4.188392 -3.962062 0.683812
H  3.400307 -4.097002 2.269847
H  2.504468 -4.52085 0.803201
H  -0.94702 1.70535 3.519175
H  -2.003384 0.729814 2.46955
H  -1.580874 2.379035 2.000609
totalener: -1560.11136574 hartree
nucrepener: 3313.37107610 hartree
electener: -4873.48244184 hartree
oneelecener: -8729.55894190 hartree
twoeener: 3856.07650006 hartree
kineticenergy: 1554.06430274 hartree
xcener: -142.350722180797 hartree
chargesum: 0.0000000
charge: -0.149715 -0.169563 -0.171068 -0.274673 -0.257882 -0.275116 -0.264928 -0.392561 -0.359155 -0.298327 -0.026054 0.129936 0.018267 -0.137070 0.224107 -0.153467 -0.225303 -0.149672 -0.125442 0.361026 -0.232594 -0.286663 0.380896 -0.239008 0.042585 0.442155 0.168314 0.512542 -0.147765 -0.135082 0.104521 0.125313 0.100555 0.018997 0.114344 0.124424 0.123366 0.092164 0.078003 0.087390 0.084256 0.101057 0.092392 0.135420 0.123035 0.112538 0.115475 0.112443 0.121334 0.104438 0.119817
qa: -0.1497 -0.1696 -0.1711 -0.2747 -0.2579 -0.2751 -0.2649 -0.3926 -0.3592 -0.2983 -0.0261 0.1299 0.0183 -0.1371 0.2241 -0.1535 -0.2253 -0.1497 -0.1254 0.3610 -0.2326 -0.2867 0.3809 -0.2390 0.0426 0.4422 0.1683 0.5125 -0.1478 -0.1351 0.1045 0.1253 0.1006 0.0190 0.1143 0.1244 0.1234 0.0922 0.0780 0.0874 0.0843 0.1011 0.0924 0.1354 0.1230 0.1125 0.1155 0.1124 0.1213 0.1044 0.1198
va: 1.1655 1.1352 1.1192 2.1378 2.1636 2.1243 2.1077 2.1247 2.9285 2.9791 3.6216 3.3929 3.8379 3.9024 3.8073 3.9906 3.6251 3.9502 3.9432 4.0638 3.9347 3.9171 4.2976 3.9298 3.9556 4.1544 3.9370 4.4778 3.9055 3.8686 1.0074 0.9893 1.0089 1.0310 1.0144 1.0014 1.0018 1.0094 1.0082 1.0109 1.0076 1.0112 1.0160 1.0249 1.0315 0.9941 0.9969 0.9939 0.9917 0.9996 0.9913
dispcorr: -0.034364894 hartree
energy: -1560.145730637953
dipole: 36.38336 -34.61709 1.76627 20.58127 -20.02470 0.55656 -6.29197 5.91616 -0.37581
magnitude: 1.88963 au
magnitude: 4.80307 debye
