program: Orca
programVersion: 5.0.2
elementType: O O O N N C C C C C C C C C C C C C C C C C H H H H H H H H H H H H H H H H H H H H
charge: 0
multiplicity: 1
keywords: wb97x-d3
keywords: def2-TZVPP
keywords: def2/J RIJCOSX
keywords: DEFGRID2
keywords: scfconv7
keywords: smallprint printgap noloewdin
keywords: NOSOSCF
formula: C17H20N2O3
InChI: InChI=1/C17H20N2O3/c1-12(2)22-17(20)19-18-15-11-14(9-10-16(15)21-3)13-7-5-4-6-8-13/h4-12,18-19H,1-3H3
42 atoms
O  2.167011 -2.445698 1.03501
O  2.27461 3.104646 -0.837936
O  2.36313 -1.145217 -0.804457
N  2.179045 1.038294 0.837852
N  2.252903 -0.254195 1.27925
C  -1.37316 1.213708 -0.242696
C  1.010113 1.425674 0.175706
C  -0.200319 0.786766 0.386473
C  -2.645137 0.503854 -0.003407
C  1.0559 2.535729 -0.686237
C  -1.308689 2.309085 -1.093211
C  -0.102119 2.96418 -1.31376
C  2.094031 -3.661346 0.251692
C  -3.847422 1.206665 0.100328
C  -2.677689 -0.886482 0.125822
C  2.536519 -4.779228 1.169187
C  0.682845 -3.858668 -0.265242
C  -5.043103 0.541169 0.325731
C  -3.873392 -1.552078 0.351184
C  -5.061942 -0.841384 0.452819
C  2.258866 -1.285982 0.396875
C  2.413412 4.150143 -1.781836
H  -0.243111 -0.05152 1.070628
H  -2.192622 2.652546 -1.614512
H  -0.081916 3.805563 -1.993178
H  2.792095 -3.583313 -0.58441
H  3.036501 1.351192 0.405907
H  -3.847104 2.28693 0.024342
H  -1.762596 -1.458954 0.030462
H  1.865282 -4.886924 2.022462
H  2.53222 -5.720085 0.619729
H  3.548802 -4.61697 1.53976
H  0.367316 -3.051452 -0.925876
H  -0.029253 -3.931859 0.558307
H  0.631922 -4.786642 -0.83515
H  2.073656 -0.419182 2.259031
H  -5.961879 1.106902 0.411019
H  -3.876401 -2.630653 0.440766
H  -5.994888 -1.360242 0.629996
H  1.815707 5.024139 -1.512323
H  2.138058 3.826229 -2.788575
H  3.463768 4.431137 -1.778962
elementType: O N C H
totalener: -995.13205797 hartree
nucrepener: 1770.61737908 hartree
electener: -2765.74943705 hartree
oneelecener: -4871.70816036 hartree
twoeener: 2105.95872331 hartree
cpcmener: -0.03722115 hartree
kineticenergy: 990.78320511 hartree
xcener: -96.154366043558 hartree
chargesum: -0.0000000
charge: -0.323942 -0.354352 -0.537287 -0.132441 -0.118674 0.124796 -0.025580 -0.176840 0.094052 0.261004 -0.245778 -0.203383 0.171378 -0.205871 -0.209235 -0.257491 -0.274176 -0.171911 -0.175956 -0.155513 0.494183 -0.129438 0.136440 0.146030 0.144188 0.069670 0.167212 0.146096 0.151288 0.090124 0.092608 0.098214 0.091369 0.090761 0.108320 0.195601 0.158123 0.156141 0.160964 0.112593 0.113722 0.122989
qa: -0.3239 -0.3544 -0.5373 -0.1324 -0.1187 0.1248 -0.0256 -0.1768 0.0941 0.2610 -0.2458 -0.2034 0.1714 -0.2059 -0.2092 -0.2575 -0.2742 -0.1719 -0.1760 -0.1555 0.4942 -0.1294 0.1364 0.1460 0.1442 0.0697 0.1672 0.1461 0.1513 0.0901 0.0926 0.0982 0.0914 0.0908 0.1083 0.1956 0.1581 0.1561 0.1610 0.1126 0.1137 0.1230
va: 2.0975 2.0313 1.9673 3.0972 3.2212 3.5860 4.0876 3.9119 3.5145 3.8768 3.9830 3.9003 3.7973 3.9295 3.9297 3.9406 3.8995 3.9144 3.9178 3.8862 4.3616 3.8751 1.0241 1.0043 1.0086 1.0212 1.0270 1.0058 0.9947 1.0062 1.0051 1.0076 1.0173 1.0066 1.0074 1.0050 0.9928 0.9939 0.9892 0.9847 0.9875 0.9933
dispcorr: -0.018497439 hartree
energy: -995.150555409951
dipole: 0.25231 -0.12241 0.12989 -11.29614 11.16150 -0.13464 -1.77237 2.28932 0.51695
magnitude: 0.54976 au
magnitude: 1.39738 debye
