program: Orca
programVersion: 5.0.2
elementType: O O O N N C C C C C C C C C C C C C C C C C H H H H H H H H H H H H H H H H H H H H
charge: 0
multiplicity: 1
keywords: wb97x-d3
keywords: def2-TZVPP
keywords: def2/J RIJCOSX
keywords: DEFGRID2
keywords: scfconv7
keywords: smallprint printgap noloewdin
keywords: NOSOSCF
formula: C17H20N2O3
InChI: InChI=1/C17H20N2O3/c1-12(2)22-17(20)19-18-15-11-14(9-10-16(15)21-3)13-7-5-4-6-8-13/h4-12,18-19H,1-3H3
42 atoms
O  1.981387 -2.769355 -0.24658
O  2.280725 3.333324 -0.534034
O  2.414601 -1.3176 1.434362
N  2.272096 0.67961 -0.418437
N  2.245575 -0.648495 -0.738923
C  -1.366013 1.392444 -0.129342
C  1.052582 1.356589 -0.364113
C  -0.156935 0.696091 -0.227178
C  -2.63045 0.652063 0.050401
C  1.060002 2.764064 -0.407897
C  -1.340818 2.778213 -0.190887
C  -0.134938 3.458583 -0.33087
C  1.853898 -3.917707 0.623994
C  -2.681329 -0.4815 0.865088
C  -3.80447 1.065371 -0.582577
C  0.463641 -4.484291 0.429348
C  2.949761 -4.898216 0.266797
C  -3.86682 -1.178898 1.041971
C  -4.990227 0.367304 -0.406515
C  -5.027482 -0.757744 0.406533
C  2.222791 -1.567803 0.26409
C  2.357501 4.744198 -0.617555
H  -0.178755 -0.386042 -0.218246
H  -2.256006 3.34952 -0.105778
H  -0.147581 4.539665 -0.364707
H  1.974961 -3.597871 1.659036
H  3.024466 1.170289 -0.876661
H  -1.789748 -0.811901 1.384116
H  -3.788356 1.929334 -1.23553
H  0.327857 -5.351107 1.075921
H  -0.303834 -3.753886 0.688469
H  0.303018 -4.806546 -0.60065
H  2.877178 -5.776756 0.907794
H  3.938433 -4.462048 0.412926
H  2.866563 -5.232005 -0.768711
H  1.86771 -0.915877 -1.641706
H  -3.884571 -2.049105 1.68534
H  -5.88664 0.6999 -0.913822
H  -5.953015 -1.3014 0.543545
H  1.973165 5.225931 0.284594
H  1.81678 5.130107 -1.485156
H  3.411183 4.990551 -0.723669
elementType: O N C H
totalener: -995.13033762 hartree
nucrepener: 1746.43901499 hartree
electener: -2741.56935261 hartree
oneelecener: -4823.01937328 hartree
twoeener: 2081.45002066 hartree
cpcmener: -0.04106967 hartree
kineticenergy: 990.77907102 hartree
xcener: -96.152101725077 hartree
chargesum: 0.0000000
charge: -0.331425 -0.353551 -0.529492 -0.120425 -0.145509 0.123054 0.047096 -0.201147 0.086659 0.234374 -0.256123 -0.191171 0.155872 -0.217699 -0.206705 -0.252319 -0.254422 -0.172105 -0.174241 -0.154590 0.505530 -0.130147 0.137549 0.144251 0.142915 0.072093 0.171837 0.147900 0.146960 0.095408 0.092342 0.089094 0.094364 0.095912 0.088972 0.191241 0.158472 0.158564 0.160749 0.113155 0.113099 0.123610
qa: -0.3314 -0.3536 -0.5295 -0.1204 -0.1455 0.1231 0.0471 -0.2011 0.0867 0.2344 -0.2561 -0.1912 0.1559 -0.2177 -0.2067 -0.2523 -0.2544 -0.1721 -0.1742 -0.1546 0.5055 -0.1301 0.1375 0.1443 0.1429 0.0721 0.1718 0.1479 0.1470 0.0954 0.0923 0.0891 0.0944 0.0959 0.0890 0.1912 0.1585 0.1586 0.1607 0.1132 0.1131 0.1236
va: 2.0869 2.0306 1.9807 3.0675 3.1703 3.6059 4.0861 3.9277 3.5248 3.9198 3.9952 3.8864 3.8054 3.9337 3.9341 3.9296 3.9326 3.9118 3.9165 3.8855 4.3665 3.8759 1.0256 1.0053 1.0089 1.0335 1.0168 1.0050 1.0055 1.0061 1.0075 1.0073 1.0054 1.0077 1.0065 1.0132 0.9930 0.9928 0.9895 0.9859 0.9867 0.9930
dispcorr: -0.017518746 hartree
energy: -995.147856367253
dipole: 0.20000 -0.44783 -0.24783 -10.76279 10.94277 0.17998 -0.41284 -1.29964 -1.71248
magnitude: 1.73966 au
magnitude: 4.42186 debye
