program: Orca
programVersion: 5.0.2
elementType: O O O N N C C C C C C C C C C C C C C C C C H H H H H H H H H H H H H H H H H H H H
charge: 0
multiplicity: 1
keywords: wb97x-d3
keywords: def2-TZVPP
keywords: def2/J RIJCOSX
keywords: DEFGRID2
keywords: scfconv7
keywords: smallprint printgap noloewdin
keywords: NOSOSCF
formula: C17H20N2O3
InChI: InChI=1/C17H20N2O3/c1-12(2)22-17(20)19-18-15-11-14(9-10-16(15)21-3)13-7-5-4-6-8-13/h4-12,18-19H,1-3H3
42 atoms
O  2.262985 -2.559962 0.985914
O  2.16909 3.281494 -0.8481
O  2.503632 -1.749751 -1.11101
N  2.212534 0.752488 -0.061112
N  2.252254 -0.383949 0.693341
C  -1.452875 1.357997 -0.214437
C  0.975075 1.375762 -0.227695
C  -0.224882 0.717461 -0.016702
C  -2.716744 0.630233 0.01559
C  0.954792 2.715718 -0.659815
C  -1.453188 2.681785 -0.630313
C  -0.256639 3.356121 -0.851998
C  2.345161 -3.934658 0.543127
C  -3.812068 1.267535 0.602211
C  -2.849584 -0.711004 -0.350275
C  2.846777 -4.731119 1.727743
C  0.988888 -4.405762 0.060049
C  -5.001678 0.586538 0.814045
C  -4.03953 -1.391879 -0.139584
C  -5.121396 -0.74648 0.444215
C  2.342434 -1.590451 0.080771
C  2.225794 4.649471 -1.206383
H  -0.215432 -0.30734 0.332753
H  -2.385507 3.201671 -0.808655
H  -0.290714 4.384977 -1.184082
H  3.07313 -4.000726 -0.267955
H  2.984125 1.372633 0.135947
H  -3.729348 2.301271 0.914367
H  -2.021844 -1.225052 -0.823433
H  3.822073 -4.378305 2.063819
H  2.151114 -4.685117 2.567014
H  2.95429 -5.776863 1.440978
H  1.060543 -5.442536 -0.269509
H  0.625501 -3.818155 -0.783118
H  0.247909 -4.35982 0.859716
H  1.98029 -0.336132 1.668856
H  -5.835603 1.098609 1.276506
H  -4.123006 -2.428365 -0.439987
H  -6.04994 -1.277236 0.609036
H  1.755825 4.836107 -2.174969
H  3.280004 4.906827 -1.274989
H  1.755915 5.286863 -0.453414
elementType: O N C H
totalener: -995.13160938 hartree
nucrepener: 1738.06957254 hartree
electener: -2733.20118192 hartree
oneelecener: -4806.33498853 hartree
twoeener: 2073.13380662 hartree
cpcmener: -0.04145037 hartree
kineticenergy: 990.77856288 hartree
xcener: -96.153031686706 hartree
chargesum: 0.0000000
charge: -0.334177 -0.353901 -0.539967 -0.130248 -0.146734 0.122148 0.040338 -0.196720 0.090639 0.240682 -0.255057 -0.192662 0.161001 -0.209532 -0.217230 -0.253993 -0.261533 -0.172745 -0.172396 -0.155663 0.522285 -0.131067 0.137545 0.145441 0.142554 0.067226 0.173708 0.146439 0.150910 0.096799 0.089929 0.092235 0.099848 0.092684 0.089972 0.194335 0.157727 0.158115 0.160764 0.113250 0.123095 0.113958
qa: -0.3342 -0.3539 -0.5400 -0.1302 -0.1467 0.1221 0.0403 -0.1967 0.0906 0.2407 -0.2551 -0.1927 0.1610 -0.2095 -0.2172 -0.2540 -0.2615 -0.1727 -0.1724 -0.1557 0.5223 -0.1311 0.1375 0.1454 0.1426 0.0672 0.1737 0.1464 0.1509 0.0968 0.0899 0.0922 0.0998 0.0927 0.0900 0.1943 0.1577 0.1581 0.1608 0.1132 0.1231 0.1140
va: 2.0860 2.0301 1.9656 3.0538 3.1802 3.6088 4.0834 3.9288 3.5172 3.9073 3.9890 3.8900 3.8184 3.9352 3.9345 3.9359 3.9024 3.9170 3.9132 3.8859 4.3454 3.8760 1.0259 1.0047 1.0090 1.0225 1.0165 1.0054 1.0025 1.0079 1.0065 1.0053 1.0071 1.0169 1.0069 1.0118 0.9930 0.9931 0.9894 0.9851 0.9933 0.9872
dispcorr: -0.017272679 hartree
energy: -995.148882056218
dipole: 0.88936 -0.90457 -0.01522 -9.99708 10.77763 0.78054 3.38224 -1.77243 1.60980
magnitude: 1.78912 au
magnitude: 4.54758 debye
