program: Orca
programVersion: 5.0.2
elementType: O O O N N C C C C C C C C C C C C C C C C C H H H H H H H H H H H H H H H H H H H H
charge: 0
multiplicity: 1
keywords: wb97x-d3
keywords: def2-TZVPP
keywords: def2/J RIJCOSX
keywords: DEFGRID2
keywords: scfconv7
keywords: smallprint printgap noloewdin
keywords: NOSOSCF
formula: C17H20N2O3
InChI: InChI=1/C17H20N2O3/c1-12(2)22-17(20)19-18-15-11-14(9-10-16(15)21-3)13-7-5-4-6-8-13/h4-12,18-19H,1-3H3
42 atoms
O  2.241157 -2.547991 0.962585
O  2.193342 3.303463 -0.853036
O  2.43173 -1.743581 -1.142275
N  2.264619 0.765248 -0.081678
N  2.319322 -0.372201 0.67347
C  -1.406744 1.347069 -0.190825
C  1.021011 1.384811 -0.227472
C  -0.171719 0.717136 -0.006173
C  -2.660466 0.603603 0.042336
C  0.985489 2.726236 -0.654056
C  -1.422256 2.672593 -0.600411
C  -0.233385 3.357474 -0.83057
C  2.162526 -3.920444 0.512372
C  -3.758058 1.221446 0.644868
C  -2.779861 -0.735097 -0.337169
C  2.630508 -4.771612 1.67265
C  0.743764 -4.246248 0.091284
C  -4.937244 0.523496 0.859603
C  -3.959269 -1.432838 -0.123498
C  -5.043644 -0.806885 0.476439
C  2.329912 -1.580853 0.054997
C  2.23268 4.662053 -1.247426
H  -0.152768 -0.308161 0.340873
H  -2.360645 3.185137 -0.767514
H  -0.279678 4.38755 -1.157231
H  2.843218 -4.05476 -0.331061
H  3.033695 1.388811 0.111826
H  -3.684563 2.25268 0.967332
H  -1.950043 -1.233389 -0.82336
H  1.975829 -4.663237 2.538622
H  2.624035 -5.82065 1.378506
H  3.647935 -4.517414 1.971336
H  0.048676 -4.118261 0.92245
H  0.690421 -5.285746 -0.233171
H  0.407514 -3.626313 -0.739872
H  2.057122 -0.320343 1.651696
H  -5.773225 1.019762 1.335305
H  -4.03282 -2.4667 -0.435239
H  -5.964191 -1.350772 0.642966
H  1.750882 4.817906 -2.215808
H  3.283554 4.927706 -1.333674
H  1.764379 5.315157 -0.507014
elementType: O N C H
totalener: -995.13168958 hartree
nucrepener: 1745.32632797 hartree
electener: -2740.45801755 hartree
oneelecener: -4820.82916947 hartree
twoeener: 2080.37115191 hartree
cpcmener: -0.04131954 hartree
kineticenergy: 990.77453687 hartree
xcener: -96.151704684117 hartree
chargesum: 0.0000000
charge: -0.332083 -0.353698 -0.534424 -0.125145 -0.146298 0.123744 0.042381 -0.200367 0.092169 0.237876 -0.255683 -0.192102 0.161268 -0.210002 -0.219922 -0.255152 -0.262659 -0.171755 -0.172112 -0.156378 0.511026 -0.131093 0.139007 0.145464 0.142428 0.068485 0.172632 0.146428 0.152368 0.090031 0.092130 0.097172 0.089881 0.101684 0.092537 0.193634 0.157569 0.158068 0.160646 0.113671 0.123105 0.113467
qa: -0.3321 -0.3537 -0.5344 -0.1251 -0.1463 0.1237 0.0424 -0.2004 0.0922 0.2379 -0.2557 -0.1921 0.1613 -0.2100 -0.2199 -0.2552 -0.2627 -0.1718 -0.1721 -0.1564 0.5110 -0.1311 0.1390 0.1455 0.1424 0.0685 0.1726 0.1464 0.1524 0.0900 0.0921 0.0972 0.0899 0.1017 0.0925 0.1936 0.1576 0.1581 0.1606 0.1137 0.1231 0.1135
va: 2.0864 2.0304 1.9711 3.0591 3.1805 3.6059 4.0863 3.9310 3.5125 3.9132 3.9913 3.8873 3.8170 3.9359 3.9356 3.9374 3.8972 3.9164 3.9138 3.8868 4.3574 3.8762 1.0238 1.0047 1.0091 1.0217 1.0164 1.0055 1.0012 1.0061 1.0054 1.0080 1.0072 1.0076 1.0169 1.0122 0.9930 0.9932 0.9895 0.9856 0.9933 0.9866
dispcorr: -0.017586113 hartree
energy: -995.149275694642
dipole: -0.10435 0.02496 -0.07939 -9.82511 10.60583 0.78073 3.30320 -1.72051 1.58268
magnitude: 1.76656 au
magnitude: 4.49023 debye
