program: Orca
programVersion: 5.0.2
elementType: O O O N N C C C C C C C C C C C C C C C C C H H H H H H H H H H H H H H H H H H H H
charge: 0
multiplicity: 1
keywords: wb97x-d3
keywords: def2-TZVPP
keywords: def2/J RIJCOSX
keywords: DEFGRID2
keywords: scfconv7
keywords: smallprint printgap noloewdin
keywords: NOSOSCF
formula: C17H20N2O3
InChI: InChI=1/C17H20N2O3/c1-12(2)22-17(20)19-18-15-11-14(9-10-16(15)21-3)13-7-5-4-6-8-13/h4-12,18-19H,1-3H3
42 atoms
O  2.270747 -1.895491 0.288505
O  2.396051 3.018082 -0.22974
O  1.807384 -2.927641 -1.665418
N  2.2291 0.446137 -0.856501
N  2.121456 -0.700642 -1.592768
C  -1.321437 1.181039 -0.033584
C  1.05906 1.127249 -0.51807
C  -0.175437 0.501142 -0.458278
C  -2.613899 0.472713 0.054131
C  1.155288 2.482947 -0.14993
C  -1.207725 2.518512 0.319446
C  0.021887 3.166303 0.255073
C  2.006577 -3.094138 1.056151
C  -3.490118 0.723298 1.112474
C  -2.987209 -0.471852 -0.9046
C  2.769643 -2.941771 2.352939
C  0.513495 -3.237129 1.278805
C  -4.699545 0.051477 1.209742
C  -4.197111 -1.143608 -0.807814
C  -5.058537 -0.885976 0.250456
C  2.043196 -1.926835 -1.015004
C  2.556778 4.389354 0.082132
H  -0.258997 -0.544779 -0.724696
H  -2.078538 3.080659 0.630962
H  0.074791 4.21238 0.525679
H  2.391077 -3.959023 0.511963
H  2.997039 1.025175 -1.160602
H  -3.214374 1.434797 1.880939
H  -2.334808 -0.673005 -1.745444
H  2.416963 -2.083679 2.927947
H  2.625462 -3.833421 2.962477
H  3.840209 -2.828284 2.17907
H  -0.03494 -3.356794 0.344109
H  0.111981 -2.370276 1.806616
H  0.317518 -4.120648 1.886576
H  1.775119 -0.635967 -2.543625
H  -5.358831 0.254843 2.043688
H  -4.469049 -1.867485 -1.565203
H  -6.000759 -1.412534 0.327629
H  1.967243 5.029117 -0.57926
H  3.610627 4.617196 -0.059032
H  2.286924 4.604722 1.118931
elementType: O N C H
totalener: -995.12981503 hartree
nucrepener: 1779.00017567 hartree
electener: -2774.12999070 hartree
oneelecener: -4888.05643778 hartree
twoeener: 2113.92644708 hartree
cpcmener: -0.03786106 hartree
kineticenergy: 990.76714458 hartree
xcener: -96.150935650857 hartree
chargesum: -0.0000000
charge: -0.305481 -0.354553 -0.543502 -0.108095 -0.141978 0.145514 0.039628 -0.222667 0.077766 0.240932 -0.259327 -0.189746 0.167408 -0.204299 -0.216142 -0.257325 -0.271460 -0.175394 -0.168072 -0.154962 0.481316 -0.130334 0.138866 0.145051 0.142707 0.068974 0.169712 0.146535 0.147175 0.090795 0.091799 0.097934 0.094236 0.090196 0.106722 0.192646 0.158663 0.158606 0.161235 0.112607 0.123299 0.113015
qa: -0.3055 -0.3546 -0.5435 -0.1081 -0.1420 0.1455 0.0396 -0.2227 0.0778 0.2409 -0.2593 -0.1897 0.1674 -0.2043 -0.2161 -0.2573 -0.2715 -0.1754 -0.1681 -0.1550 0.4813 -0.1303 0.1389 0.1451 0.1427 0.0690 0.1697 0.1465 0.1472 0.0908 0.0918 0.0979 0.0942 0.0902 0.1067 0.1926 0.1587 0.1586 0.1612 0.1126 0.1233 0.1130
va: 2.1115 2.0291 1.9611 3.0549 3.1919 3.5887 4.0954 3.9391 3.5249 3.9075 3.9954 3.8897 3.7871 3.9301 3.9255 3.9403 3.9014 3.9192 3.9094 3.8853 4.3972 3.8766 1.0151 1.0046 1.0089 1.0228 1.0211 1.0053 1.0047 1.0056 1.0054 1.0077 1.0171 1.0058 1.0091 1.0104 0.9929 0.9927 0.9894 0.9868 0.9931 0.9857
dispcorr: -0.018586694 hartree
energy: -995.148401719047
dipole: 0.64693 -0.42932 0.21761 -3.18600 5.02595 1.83995 10.07218 -9.40578 0.66639
magnitude: 1.96897 au
magnitude: 5.00473 debye
