program: Orca
programVersion: 5.0.2
elementType: O O O N N C C C C C C C C C C C C C C C C C H H H H H H H H H H H H H H H H H H H H
charge: 0
multiplicity: 1
keywords: wb97x-d3
keywords: def2-TZVPP
keywords: def2/J RIJCOSX
keywords: DEFGRID2
keywords: scfconv7
keywords: smallprint printgap noloewdin
keywords: NOSOSCF
formula: C17H20N2O3
InChI: InChI=1/C17H20N2O3/c1-12(2)22-17(20)19-18-15-11-14(9-10-16(15)21-3)13-7-5-4-6-8-13/h4-12,18-19H,1-3H3
42 atoms
O  1.980298 -2.537011 0.818426
O  2.291924 3.126534 -0.591219
O  2.292718 -1.092269 -0.897425
N  2.144853 0.944063 0.929812
N  2.192851 -0.385287 1.256346
C  -1.394639 1.267791 -0.162102
C  0.985307 1.410445 0.300598
C  -0.240202 0.785739 0.460992
C  -2.681977 0.568059 0.017573
C  1.061237 2.571456 -0.48953
C  -1.298543 2.407205 -0.949037
C  -0.079147 3.05669 -1.107752
C  1.951403 -3.705253 -0.037568
C  -3.050353 0.051258 1.261318
C  -3.560839 0.40437 -1.05491
C  3.191531 -4.526957 0.239998
C  0.666622 -4.448674 0.25641
C  -4.258319 -0.610324 1.426868
C  -4.768133 -0.258363 -0.889944
C  -5.122468 -0.768813 0.351746
C  2.156739 -1.335407 0.283484
C  2.454838 4.242102 -1.447081
H  -0.302167 -0.113575 1.061293
H  -2.176447 2.815468 -1.432728
H  -0.038513 3.946962 -1.720765
H  1.952242 -3.384013 -1.079193
H  3.007764 1.26965 0.518661
H  -2.394521 0.18114 2.113479
H  -3.290261 0.780652 -2.03374
H  3.222175 -4.865732 1.276703
H  3.19754 -5.408613 -0.400741
H  4.099937 -3.960261 0.032524
H  0.623861 -4.783603 1.293951
H  0.601959 -5.32949 -0.382043
H  -0.207099 -3.828081 0.054826
H  1.960095 -0.628278 2.208336
H  -4.527371 -0.997177 2.401244
H  -5.430118 -0.38298 -1.73709
H  -6.063818 -1.286815 0.480196
H  3.509386 4.505218 -1.414713
H  1.869263 5.10153 -1.111524
H  2.18241 4.006488 -2.478739
elementType: O N C H
totalener: -995.13079761 hartree
nucrepener: 1759.05916365 hartree
electener: -2754.18996126 hartree
oneelecener: -4848.69077923 hartree
twoeener: 2094.50081797 hartree
cpcmener: -0.03684507 hartree
kineticenergy: 990.77880606 hartree
xcener: -96.152125229934 hartree
chargesum: -0.0000000
charge: -0.325857 -0.353209 -0.533779 -0.132812 -0.122238 0.135472 -0.029507 -0.178645 0.095678 0.263451 -0.251631 -0.197444 0.157747 -0.215656 -0.205407 -0.255255 -0.252427 -0.172100 -0.176368 -0.154048 0.496416 -0.129852 0.134582 0.145472 0.143940 0.072453 0.166825 0.147780 0.146678 0.088518 0.096113 0.096413 0.088633 0.094447 0.094962 0.193449 0.158316 0.158304 0.161000 0.123100 0.113111 0.113377
qa: -0.3259 -0.3532 -0.5338 -0.1328 -0.1222 0.1355 -0.0295 -0.1786 0.0957 0.2635 -0.2516 -0.1974 0.1577 -0.2157 -0.2054 -0.2553 -0.2524 -0.1721 -0.1764 -0.1540 0.4964 -0.1299 0.1346 0.1455 0.1439 0.0725 0.1668 0.1478 0.1467 0.0885 0.0961 0.0964 0.0886 0.0944 0.0950 0.1934 0.1583 0.1583 0.1610 0.1231 0.1131 0.1134
va: 2.0925 2.0327 1.9763 3.0966 3.2071 3.5697 4.0945 3.9141 3.5086 3.8754 3.9856 3.8991 3.7985 3.9350 3.9297 3.9350 3.9326 3.9104 3.9200 3.8833 4.3649 3.8751 1.0262 1.0047 1.0084 1.0327 1.0274 1.0040 1.0051 1.0067 1.0055 1.0073 1.0070 1.0054 1.0079 1.0056 0.9928 0.9930 0.9894 0.9932 0.9848 0.9875
dispcorr: -0.017573999 hartree
energy: -995.148371604845
dipole: 1.83104 -1.71856 0.11247 -11.64368 11.42923 -0.21445 -2.14285 2.61211 0.46926
magnitude: 0.52806 au
magnitude: 1.34221 debye
