program: Orca
programVersion: 5.0.2
elementType: O O O N N C C C C C C C C C C C C C C C C C H H H H H H H H H H H H H H H H H H H H
charge: 0
multiplicity: 1
keywords: wb97x-d3
keywords: def2-TZVPP
keywords: def2/J RIJCOSX
keywords: DEFGRID2
keywords: scfconv7
keywords: smallprint printgap noloewdin
keywords: NOSOSCF
formula: C17H20N2O3
InChI: InChI=1/C17H20N2O3/c1-12(2)22-17(20)19-18-15-11-14(9-10-16(15)21-3)13-7-5-4-6-8-13/h4-12,18-19H,1-3H3
42 atoms
O  2.123727 -1.445943 0.225524
O  2.470949 2.596942 -0.168515
O  1.693089 -3.074185 -1.282698
N  1.99453 0.415626 -1.607661
N  1.931705 -0.917943 -1.917303
C  -1.353317 0.982132 -0.090218
C  0.953703 0.960709 -0.850976
C  -0.318888 0.41516 -0.840407
C  -2.690275 0.355407 -0.073932
C  1.204135 2.124292 -0.102145
C  -1.086018 2.128158 0.6476
C  0.183578 2.695468 0.639542
C  1.922222 -2.288309 1.382949
C  -3.848641 1.134343 -0.02862
C  -2.829267 -1.034376 -0.09577
C  3.273628 -2.605332 1.984607
C  1.014085 -1.52314 2.321557
C  -5.103525 0.54381 -0.005417
C  -4.084118 -1.624995 -0.075963
C  -5.227814 -0.838888 -0.030375
C  1.894086 -1.910949 -0.990114
C  2.818674 3.705141 0.640077
H  -0.519047 -0.465507 -1.438062
H  -1.85467 2.579866 1.260999
H  0.363365 3.579452 1.236531
H  1.431699 -3.212411 1.074832
H  2.918435 0.702393 -1.317757
H  -3.771415 2.214561 -0.030131
H  -1.948118 -1.664448 -0.11005
H  3.905569 -3.147515 1.280461
H  3.795442 -1.698079 2.293208
H  3.143911 -3.233492 2.865874
H  0.845958 -2.10565 3.227209
H  0.042172 -1.331231 1.864174
H  1.454519 -0.568211 2.613196
H  1.690673 -1.158011 -2.867479
H  -5.987446 1.167642 0.023866
H  -4.167113 -2.704083 -0.08843
H  -6.206696 -1.299793 -0.014154
H  3.8726 3.90143 0.458109
H  2.678289 3.491949 1.702588
H  2.245409 4.597205 0.376821
elementType: O N C H
totalener: -995.12906661 hartree
nucrepener: 1813.49676193 hartree
electener: -2808.62582854 hartree
oneelecener: -4956.83986393 hartree
twoeener: 2148.21403539 hartree
cpcmener: -0.03524808 hartree
kineticenergy: 990.78332105 hartree
xcener: -96.155409485855 hartree
chargesum: -0.0000000
charge: -0.307445 -0.354209 -0.541571 -0.119573 -0.130059 0.112522 -0.007177 -0.200097 0.129353 0.273006 -0.234560 -0.207042 0.154508 -0.214470 -0.227498 -0.255069 -0.259207 -0.168228 -0.173864 -0.158238 0.492957 -0.128834 0.135174 0.145009 0.143540 0.071009 0.159068 0.145262 0.140987 0.095378 0.089754 0.094788 0.105097 0.086545 0.092186 0.194611 0.158226 0.158402 0.160733 0.122965 0.113624 0.112434
qa: -0.3074 -0.3542 -0.5416 -0.1196 -0.1301 0.1125 -0.0072 -0.2001 0.1294 0.2730 -0.2346 -0.2070 0.1545 -0.2145 -0.2275 -0.2551 -0.2592 -0.1682 -0.1739 -0.1582 0.4930 -0.1288 0.1352 0.1450 0.1435 0.0710 0.1591 0.1453 0.1410 0.0954 0.0898 0.0948 0.1051 0.0865 0.0922 0.1946 0.1582 0.1584 0.1607 0.1230 0.1136 0.1124
va: 2.1003 2.0296 1.9663 3.0915 3.2168 3.5624 4.0624 3.8993 3.4713 3.8449 3.9765 3.9056 3.7841 3.9419 3.9310 3.9339 3.9252 3.9108 3.9322 3.8908 4.3678 3.8750 1.0253 1.0040 1.0087 1.0311 1.0335 1.0070 1.0089 1.0089 1.0061 1.0058 1.0102 1.0055 1.0062 1.0038 0.9928 0.9931 0.9895 0.9932 0.9875 0.9851
dispcorr: -0.020283383 hartree
energy: -995.149349994732
dipole: 3.80003 -3.24640 0.55364 -0.39441 1.97884 1.58442 13.55968 -12.25371 1.30597
magnitude: 2.12661 au
magnitude: 5.40541 debye
