program: Orca
programVersion: 5.0.2
elementType: O O O N N C C C C C C C C C C C C C C C C C H H H H H H H H H H H H H H H H H H H H
charge: 0
multiplicity: 1
keywords: wb97x-d3
keywords: def2-TZVPP
keywords: def2/J RIJCOSX
keywords: DEFGRID2
keywords: scfconv7
keywords: smallprint printgap noloewdin
keywords: NOSOSCF
formula: C17H20N2O3
InChI: InChI=1/C17H20N2O3/c1-12(2)22-17(20)19-18-15-11-14(9-10-16(15)21-3)13-7-5-4-6-8-13/h4-12,18-19H,1-3H3
42 atoms
O  2.068319 -2.732066 -0.269644
O  2.335905 3.077074 -0.580696
O  2.429776 -0.835331 0.905975
N  2.04045 0.567145 -1.406591
N  2.077199 -0.799109 -1.334449
C  -1.364698 1.260891 -0.085882
C  0.951339 1.213725 -0.813514
C  -0.278268 0.595159 -0.660929
C  -2.664701 0.577133 0.067381
C  1.104505 2.547523 -0.394818
C  -1.193135 2.574029 0.330901
C  0.032064 3.213155 0.175296
C  2.135042 -3.563063 0.914678
C  -3.435507 0.760125 1.217212
C  -3.15772 -0.263188 -0.933001
C  0.797726 -3.559085 1.626549
C  2.535329 -4.941486 0.439587
C  -4.660142 0.125183 1.361359
C  -4.383353 -0.89696 -0.789811
C  -5.140707 -0.705535 0.358035
C  2.201091 -1.420574 -0.133417
C  2.586549 4.380257 -0.088164
H  -0.394876 -0.435883 -0.9714
H  -2.017836 3.124543 0.76424
H  0.131014 4.238515 0.505082
H  2.911174 -3.170668 1.575126
H  2.938123 0.984655 -1.207255
H  -3.066969 1.389953 2.017351
H  -2.588472 -0.408324 -1.842919
H  0.507925 -2.561083 1.9540
H  0.009407 -3.957411 0.986173
H  0.85844 -4.189784 2.513892
H  1.783779 -5.371443 -0.224049
H  2.639743 -5.603006 1.299218
H  3.492364 -4.922556 -0.081997
H  1.77669 -1.31308 -2.149729
H  -5.237387 0.274698 2.264626
H  -4.750954 -1.535623 -1.582637
H  -6.096861 -1.199752 0.469847
H  3.632149 4.593068 -0.296874
H  2.421838 4.444972 0.990157
H  1.968485 5.129526 -0.588536
elementType: O N C H
totalener: -995.13186754 hartree
nucrepener: 1764.06168342 hartree
electener: -2759.19355096 hartree
oneelecener: -4858.78131109 hartree
twoeener: 2099.58776012 hartree
cpcmener: -0.03729694 hartree
kineticenergy: 990.78460932 hartree
xcener: -96.153975623888 hartree
chargesum: -0.0000000
charge: -0.324497 -0.353284 -0.540043 -0.132808 -0.120827 0.138925 -0.032851 -0.179741 0.089972 0.265534 -0.251961 -0.197555 0.163833 -0.202989 -0.212462 -0.258355 -0.255184 -0.177595 -0.173850 -0.153618 0.499748 -0.129058 0.133866 0.145335 0.143696 0.069103 0.166745 0.148014 0.147462 0.091493 0.089946 0.099450 0.089737 0.093166 0.097570 0.195431 0.158122 0.159096 0.161265 0.123018 0.113382 0.112767
qa: -0.3245 -0.3533 -0.5400 -0.1328 -0.1208 0.1389 -0.0329 -0.1797 0.0900 0.2655 -0.2520 -0.1976 0.1638 -0.2030 -0.2125 -0.2584 -0.2552 -0.1776 -0.1738 -0.1536 0.4997 -0.1291 0.1339 0.1453 0.1437 0.0691 0.1667 0.1480 0.1475 0.0915 0.0899 0.0995 0.0897 0.0932 0.0976 0.1954 0.1581 0.1591 0.1613 0.1230 0.1134 0.1128
va: 2.0970 2.0326 1.9641 3.0989 3.2219 3.5706 4.0896 3.9125 3.5183 3.8739 3.9840 3.9004 3.8068 3.9274 3.9335 3.9022 3.9387 3.9187 3.9115 3.8826 4.3575 3.8748 1.0258 1.0049 1.0085 1.0219 1.0284 1.0044 1.0040 1.0186 1.0072 1.0068 1.0065 1.0050 1.0076 1.0052 0.9931 0.9925 0.9894 0.9931 0.9876 0.9850
dispcorr: -0.017833277 hartree
energy: -995.149700819434
dipole: 0.94907 -0.85467 0.09440 -9.91906 9.57635 -0.34271 5.98047 -6.38291 -0.40244
magnitude: 0.53695 au
magnitude: 1.36482 debye
