program: Orca
programVersion: 5.0.2
elementType: O O O N N C C C C C C C C C C C C C C C C C H H H H H H H H H H H H H H H H H H H H
charge: 0
multiplicity: 1
keywords: wb97x-d3
keywords: def2-TZVPP
keywords: def2/J RIJCOSX
keywords: DEFGRID2
keywords: scfconv7
keywords: smallprint printgap noloewdin
keywords: NOSOSCF
formula: C17H20N2O3
InChI: InChI=1/C17H20N2O3/c1-12(2)22-17(20)19-18-15-11-14(9-10-16(15)21-3)13-7-5-4-6-8-13/h4-12,18-19H,1-3H3
42 atoms
O  2.044542 -1.497401 -0.160375
O  2.516695 2.608844 0.088971
O  1.60115 -3.023407 1.445818
N  2.011553 0.468783 1.574568
N  1.916299 -0.843699 1.954765
C  -1.325499 1.036848 0.032981
C  0.977847 1.006999 0.804421
C  -0.301662 0.47752 0.803063
C  -2.668664 0.423571 0.026586
C  1.244877 2.148346 0.027136
C  -1.041461 2.158857 -0.73463
C  0.23503 2.710906 -0.735316
C  1.780374 -2.411035 -1.249812
C  -2.819931 -0.964529 0.064123
C  -3.819484 1.212851 -0.024808
C  1.241921 -1.561208 -2.380473
C  3.050076 -3.15033 -1.613983
C  -4.079949 -1.544058 0.053959
C  -5.079775 0.633357 -0.037704
C  -5.216447 -0.74781 0.003027
C  1.83182 -1.884743 1.085331
C  2.886651 3.678827 -0.76005
H  -0.517525 -0.383624 1.423172
H  -1.802218 2.602122 -1.363871
H  0.428568 3.576358 -1.354758
H  1.013881 -3.122466 -0.936527
H  2.940106 0.718634 1.265787
H  -1.943693 -1.601319 0.081856
H  -3.731471 2.292222 -0.036291
H  1.012003 -2.194513 -3.236799
H  0.323942 -1.049033 -2.088287
H  1.969936 -0.814678 -2.701913
H  3.835505 -2.458011 -1.921443
H  2.853333 -3.825113 -2.447151
H  3.421346 -3.750124 -0.782773
H  1.693969 -1.026923 2.922053
H  -4.172713 -2.622172 0.077729
H  -5.958204 1.264666 -0.071198
H  -6.199525 -1.19989 -0.005464
H  2.327083 4.589852 -0.535194
H  2.748156 3.426582 -1.814224
H  3.94275 3.864969 -0.579897
elementType: O N C H
totalener: -995.12956116 hartree
nucrepener: 1811.20813435 hartree
electener: -2806.33769551 hartree
oneelecener: -4952.28252952 hartree
twoeener: 2145.94483400 hartree
cpcmener: -0.03519413 hartree
kineticenergy: 990.77972099 hartree
xcener: -96.154643734754 hartree
chargesum: 0.0000000
charge: -0.308408 -0.354498 -0.543501 -0.119307 -0.129433 0.114133 -0.005331 -0.198024 0.120932 0.266228 -0.239435 -0.203062 0.154141 -0.226331 -0.214839 -0.255932 -0.256350 -0.169365 -0.168343 -0.158358 0.493901 -0.128702 0.136402 0.145313 0.143745 0.067541 0.160311 0.145501 0.145614 0.102186 0.089082 0.092757 0.089850 0.097387 0.093122 0.195319 0.157865 0.158457 0.160482 0.112156 0.113861 0.122928
qa: -0.3084 -0.3545 -0.5435 -0.1193 -0.1294 0.1141 -0.0053 -0.1980 0.1209 0.2662 -0.2394 -0.2031 0.1541 -0.2263 -0.2148 -0.2559 -0.2564 -0.1694 -0.1683 -0.1584 0.4939 -0.1287 0.1364 0.1453 0.1437 0.0675 0.1603 0.1455 0.1456 0.1022 0.0891 0.0928 0.0899 0.0974 0.0931 0.1953 0.1579 0.1585 0.1605 0.1122 0.1139 0.1229
va: 2.1049 2.0292 1.9623 3.0887 3.2218 3.5517 4.0767 3.8918 3.4808 3.8545 3.9765 3.9026 3.7958 3.9295 3.9411 3.9274 3.9250 3.9217 3.9102 3.8893 4.3639 3.8751 1.0247 1.0041 1.0084 1.0241 1.0320 1.0070 1.0067 1.0093 1.0051 1.0064 1.0065 1.0066 1.0144 1.0035 0.9934 0.9927 0.9896 0.9849 0.9876 0.9933
dispcorr: -0.020130784 hartree
energy: -995.149691944409
dipole: 4.01214 -3.42618 0.58596 -1.70966 3.20549 1.49583 -13.28874 11.91942 -1.36932
magnitude: 2.11090 au
magnitude: 5.36548 debye
