program: Orca
programVersion: 5.0.2
elementType: O O O N N C C C C C C C C C C C C C C C C C H H H H H H H H H H H H H H H H H H H H
charge: 0
multiplicity: 1
keywords: wb97x-d3
keywords: def2-TZVPP
keywords: def2/J RIJCOSX
keywords: DEFGRID2
keywords: scfconv7
keywords: smallprint printgap noloewdin
keywords: NOSOSCF
formula: C17H20N2O3
InChI: InChI=1/C17H20N2O3/c1-12(2)22-17(20)19-18-15-11-14(9-10-16(15)21-3)13-7-5-4-6-8-13/h4-12,18-19H,1-3H3
42 atoms
O  2.264106 -2.475012 1.063995
O  2.239927 3.060037 -0.817418
O  2.391229 -1.171766 -0.778717
N  2.090992 1.005599 0.856414
N  2.155489 -0.284729 1.295201
C  -1.445083 1.236477 -0.264083
C  0.936547 1.407748 0.182417
C  -0.287095 0.789177 0.379092
C  -2.735081 0.554754 -0.03701
C  1.011203 2.515363 -0.681656
C  -1.351263 2.328255 -1.116503
C  -0.130944 2.962007 -1.32439
C  2.33164 -3.693064 0.288578
C  -3.920887 1.285317 0.066588
C  -2.803061 -0.83525 0.078822
C  2.84498 -4.76202 1.227988
C  0.965821 -4.025903 -0.277928
C  -5.13414 0.647354 0.277013
C  -4.016118 -1.473532 0.290236
C  -5.187669 -0.735293 0.390557
C  2.275842 -1.314403 0.418185
C  2.416613 4.100782 -1.756351
H  -0.349177 -0.047526 1.063918
H  -2.223047 2.684469 -1.65025
H  -0.088833 3.80069 -2.00657
H  3.047753 -3.554656 -0.524586
H  2.959007 1.333879 0.458638
H  -3.893181 2.366285 0.002587
H  -1.901501 -1.428356 -0.018336
H  2.951427 -5.701288 0.685338
H  3.823633 -4.503834 1.634146
H  2.158621 -4.93298 2.058921
H  0.595878 -3.247015 -0.945099
H  0.234076 -4.174837 0.518241
H  1.024031 -4.948972 -0.855885
H  2.048037 -0.449338 2.283531
H  -6.039821 1.234632 0.361667
H  -4.046371 -2.552858 0.369359
H  -6.134452 -1.233242 0.556502
H  2.154656 3.784607 -2.76979
H  3.472765 4.361083 -1.734986
H  1.833904 4.989075 -1.498098
elementType: O N C H
totalener: -995.14024809 hartree
nucrepener: 1759.45252675 hartree
electener: -2754.59277484 hartree
oneelecener: -4849.27695588 hartree
twoeener: 2094.68418104 hartree
cpcmener: -0.03082225 hartree
kineticenergy: 990.78526059 hartree
xcener: -96.154050428634 hartree
chargesum: 0.0000000
charge: -0.323622 -0.345124 -0.508681 -0.136019 -0.121203 0.129035 -0.017482 -0.176524 0.096630 0.261601 -0.244910 -0.199785 0.165660 -0.210343 -0.217289 -0.254963 -0.268133 -0.165526 -0.165095 -0.155727 0.486100 -0.132494 0.131280 0.143266 0.140151 0.067618 0.163963 0.143483 0.151300 0.091136 0.096835 0.089113 0.092520 0.088804 0.102400 0.193698 0.154281 0.153060 0.156796 0.112575 0.120989 0.110626
qa: -0.3236 -0.3451 -0.5087 -0.1360 -0.1212 0.1290 -0.0175 -0.1765 0.0966 0.2616 -0.2449 -0.1998 0.1657 -0.2103 -0.2173 -0.2550 -0.2681 -0.1655 -0.1651 -0.1557 0.4861 -0.1325 0.1313 0.1433 0.1402 0.0676 0.1640 0.1435 0.1513 0.0911 0.0968 0.0891 0.0925 0.0888 0.1024 0.1937 0.1543 0.1531 0.1568 0.1126 0.1210 0.1106
va: 2.0955 2.0406 2.0051 3.0986 3.2068 3.5963 4.0906 3.9252 3.5238 3.8760 3.9885 3.9018 3.8114 3.9431 3.9394 3.9388 3.8989 3.9184 3.9163 3.8966 4.3726 3.8819 1.0277 1.0050 1.0095 1.0216 1.0309 1.0065 0.9978 1.0055 1.0081 1.0064 1.0192 1.0069 1.0075 1.0074 0.9939 0.9947 0.9906 0.9873 0.9939 0.9846
dispcorr: -0.017970705 hartree
energy: -995.158218794904
dipole: 1.61848 -1.26089 0.35760 -11.48544 11.37613 -0.10931 -1.71175 2.21547 0.50372
magnitude: 0.62734 au
magnitude: 1.59458 debye
