program: Orca
programVersion: 5.0.2
elementType: O O O N N C C C C C C C C C C C C C C C C C H H H H H H H H H H H H H H H H H H H H
charge: 0
multiplicity: 1
keywords: wb97x-d3
keywords: def2-TZVPP
keywords: def2/J RIJCOSX
keywords: DEFGRID2
keywords: scfconv7
keywords: smallprint printgap noloewdin
keywords: NOSOSCF
formula: C17H20N2O3
InChI: InChI=1/C17H20N2O3/c1-12(2)22-17(20)19-18-15-11-14(9-10-16(15)21-3)13-7-5-4-6-8-13/h4-12,18-19H,1-3H3
42 atoms
O  2.239465 -1.400142 0.38833
O  2.36536 2.477731 -0.210466
O  1.840346 -3.193823 -0.925688
N  1.847335 0.26187 -1.583364
N  1.787968 -1.093634 -1.758133
C  -1.506411 0.987537 -0.154905
C  0.813119 0.868636 -0.865629
C  -0.474911 0.359694 -0.859281
C  -2.876913 0.437707 -0.18495
C  1.087224 2.047376 -0.14894
C  -1.214691 2.143874 0.556885
C  0.072316 2.670254 0.55842
C  2.407508 -2.197795 1.580587
C  -3.41214 -0.088252 -1.362686
C  -3.676987 0.442044 0.959823
C  3.814447 -2.75578 1.640745
C  2.095838 -1.272785 2.737228
C  -4.704333 -0.59184 -1.395578
C  -4.969566 -0.060122 0.927047
C  -5.490001 -0.579059 -0.250906
C  1.948893 -1.997242 -0.75566
C  2.750093 3.57507 0.592528
H  -0.679766 -0.558161 -1.397018
H  -1.992749 2.665449 1.099488
H  0.264471 3.575591 1.119192
H  1.682626 -3.015091 1.564803
H  2.77475 0.586162 -1.348826
H  -2.822486 -0.08482 -2.27148
H  -3.280311 0.824581 1.89249
H  3.941865 -3.32969 2.55953
H  4.026651 -3.423855 0.805856
H  4.556806 -1.955378 1.641878
H  2.793628 -0.43396 2.779412
H  2.174672 -1.819253 3.677182
H  1.082186 -0.875355 2.668831
H  1.560286 -1.439173 -2.678512
H  -5.101154 -0.986964 -2.322345
H  -5.569444 -0.05163 1.828389
H  -6.499119 -0.970028 -0.276526
H  2.228528 4.492952 0.308742
H  3.816335 3.718076 0.429684
H  2.58056 3.381932 1.655337
elementType: O N C H
totalener: -995.13846693 hartree
nucrepener: 1787.97749223 hartree
electener: -2783.11595916 hartree
oneelecener: -4905.86993035 hartree
twoeener: 2122.75397119 hartree
cpcmener: -0.02999423 hartree
kineticenergy: 990.77840469 hartree
xcener: -96.152124974258 hartree
chargesum: -0.0000000
charge: -0.301677 -0.346022 -0.513731 -0.118690 -0.133114 0.131359 -0.025952 -0.182842 0.102779 0.261677 -0.245767 -0.191540 0.148451 -0.213875 -0.202953 -0.257497 -0.258803 -0.167281 -0.172546 -0.150895 0.483470 -0.130895 0.132385 0.142199 0.140192 0.066610 0.155420 0.144524 0.143591 0.095654 0.094092 0.088116 0.088986 0.097464 0.095757 0.191937 0.153866 0.154295 0.156895 0.111872 0.121256 0.111233
qa: -0.3017 -0.3460 -0.5137 -0.1187 -0.1331 0.1314 -0.0260 -0.1828 0.1028 0.2617 -0.2458 -0.1915 0.1485 -0.2139 -0.2030 -0.2575 -0.2588 -0.1673 -0.1725 -0.1509 0.4835 -0.1309 0.1324 0.1422 0.1402 0.0666 0.1554 0.1445 0.1436 0.0957 0.0941 0.0881 0.0890 0.0975 0.0958 0.1919 0.1539 0.1543 0.1569 0.1119 0.1213 0.1112
va: 2.1087 2.0351 2.0034 3.0935 3.2131 3.5748 4.0967 3.9417 3.5204 3.8528 3.9939 3.8986 3.8221 3.9435 3.9363 3.9045 3.9291 3.9191 3.9240 3.8918 4.3702 3.8802 1.0265 1.0055 1.0089 1.0232 1.0408 1.0052 1.0058 1.0071 1.0182 1.0070 1.0057 1.0080 1.0078 1.0058 0.9942 0.9942 0.9907 0.9847 0.9937 0.9876
dispcorr: -0.018810900 hartree
energy: -995.157277830162
dipole: 7.09679 -6.35835 0.73845 0.07700 1.47143 1.54843 12.98191 -11.91226 1.06965
magnitude: 2.02165 au
magnitude: 5.13863 debye
