program: Orca
programVersion: 5.0.2
elementType: O O O N N C C C C C C C C C C C C C C C C C H H H H H H H H H H H H H H H H H H H H
charge: 0
multiplicity: 1
keywords: wb97x-d3
keywords: def2-TZVPP
keywords: def2/J RIJCOSX
keywords: DEFGRID2
keywords: scfconv7
keywords: smallprint printgap noloewdin
keywords: NOSOSCF
formula: C17H20N2O3
InChI: InChI=1/C17H20N2O3/c1-12(2)22-17(20)19-18-15-11-14(9-10-16(15)21-3)13-7-5-4-6-8-13/h4-12,18-19H,1-3H3
42 atoms
O  2.083545 -2.685288 0.911509
O  2.161728 3.248186 -0.568307
O  2.469168 -1.772164 -1.119588
N  2.091176 0.678187 0.047643
N  2.077165 -0.500495 0.729899
C  -1.542064 1.412788 -0.220471
C  0.883841 1.352371 -0.120006
C  -0.344602 0.723886 0.000281
C  -2.83753 0.718303 -0.080372
C  0.924392 2.715378 -0.472993
C  -1.482356 2.755643 -0.565354
C  -0.25677 3.402993 -0.687488
C  2.288348 -4.030695 0.430274
C  -3.041541 -0.225898 0.928119
C  -3.893941 0.991644 -0.951634
C  3.76844 -4.357273 0.422612
C  1.498658 -4.931865 1.354278
C  -4.260367 -0.874219 1.061259
C  -5.113742 0.345486 -0.817361
C  -5.303222 -0.59094 0.18999
C  2.230414 -1.672568 0.061858
C  2.284899 4.619383 -0.884875
H  -0.377056 -0.329528 0.248515
H  -2.390385 3.324731 -0.717737
H  -0.245358 4.454017 -0.943846
H  1.885497 -4.111108 -0.581894
H  2.885875 1.256066 0.272895
H  -2.247482 -0.44419 1.631822
H  -3.756114 1.70263 -1.757129
H  3.918044 -5.381059 0.077872
H  4.328456 -3.702815 -0.245784
H  4.19504 -4.275574 1.424133
H  1.595308 -5.966777 1.026268
H  0.437262 -4.680592 1.346721
H  1.861366 -4.872229 2.38209
H  1.803511 -0.505481 1.705409
H  -4.397731 -1.597015 1.855553
H  -5.915773 0.568616 -1.509545
H  -6.255053 -1.095683 0.294491
H  3.350587 4.837783 -0.9027
H  1.809796 5.257177 -0.134674
H  1.864906 4.850877 -1.867212
elementType: O N C H
totalener: -995.13978934 hartree
nucrepener: 1725.90818342 hartree
electener: -2721.04797276 hartree
oneelecener: -4781.88903986 hartree
twoeener: 2060.84106709 hartree
cpcmener: -0.03440705 hartree
kineticenergy: 990.78717604 hartree
xcener: -96.153907137808 hartree
chargesum: 0.0000000
charge: -0.333274 -0.344837 -0.505557 -0.127439 -0.155946 0.126121 0.036087 -0.194262 0.085692 0.248166 -0.252479 -0.193988 0.154781 -0.210372 -0.205345 -0.257469 -0.252007 -0.168023 -0.169540 -0.151755 0.510100 -0.133992 0.136066 0.142317 0.138993 0.067361 0.169491 0.143797 0.143290 0.096064 0.094168 0.087868 0.090326 0.096281 0.088007 0.190087 0.154176 0.154697 0.157035 0.121376 0.111932 0.112004
qa: -0.3333 -0.3448 -0.5056 -0.1274 -0.1559 0.1261 0.0361 -0.1943 0.0857 0.2482 -0.2525 -0.1940 0.1548 -0.2104 -0.2053 -0.2575 -0.2520 -0.1680 -0.1695 -0.1518 0.5101 -0.1340 0.1361 0.1423 0.1390 0.0674 0.1695 0.1438 0.1433 0.0961 0.0942 0.0879 0.0903 0.0963 0.0880 0.1901 0.1542 0.1547 0.1570 0.1214 0.1119 0.1120
va: 2.0830 2.0388 2.0113 3.0520 3.1605 3.6156 4.0903 3.9292 3.5390 3.9002 3.9954 3.9018 3.8307 3.9356 3.9365 3.9035 3.9346 3.9203 3.9234 3.8932 4.3605 3.8828 1.0248 1.0054 1.0098 1.0227 1.0219 1.0062 1.0065 1.0068 1.0175 1.0071 1.0057 1.0084 1.0067 1.0147 0.9942 0.9940 0.9906 0.9937 0.9863 0.9857
dispcorr: -0.016889546 hartree
energy: -995.156678888263
dipole: 4.22441 -4.09141 0.13300 -10.10408 10.76060 0.65652 3.50816 -1.99049 1.51766
magnitude: 1.65892 au
magnitude: 4.21664 debye
