program: Orca
programVersion: 5.0.2
elementType: O O O N N C C C C C C C C C C C C C C C C C H H H H H H H H H H H H H H H H H H H H
charge: 0
multiplicity: 1
keywords: wb97x-d3
keywords: def2-TZVPP
keywords: def2/J RIJCOSX
keywords: DEFGRID2
keywords: scfconv7
keywords: smallprint printgap noloewdin
keywords: NOSOSCF
formula: C17H20N2O3
InChI: InChI=1/C17H20N2O3/c1-12(2)22-17(20)19-18-15-11-14(9-10-16(15)21-3)13-7-5-4-6-8-13/h4-12,18-19H,1-3H3
42 atoms
O  2.135064 -1.431088 0.2941
O  2.404095 2.57775 -0.143036
O  1.735219 -3.100872 -1.172857
N  1.918526 0.39017 -1.56984
N  1.852392 -0.947094 -1.849744
C  -1.438374 1.010066 -0.102067
C  0.878716 0.95587 -0.830749
C  -0.400652 0.425427 -0.834103
C  -2.789026 0.411988 -0.116667
C  1.134833 2.120631 -0.084883
C  -1.164352 2.152455 0.638663
C  0.112498 2.70348 0.645443
C  2.132171 -2.310095 1.439197
C  -2.960728 -0.974115 -0.126131
C  -3.92982 1.217577 -0.121037
C  3.50411 -2.925388 1.617024
C  1.713261 -1.452353 2.6136
C  -4.228942 -1.535301 -0.141261
C  -5.198347 0.65675 -0.133449
C  -5.354658 -0.722653 -0.144549
C  1.8958 -1.927643 -0.908116
C  2.769343 3.668504 0.677454
H  -0.602716 -0.454984 -1.431505
H  -1.93488 2.615613 1.24137
H  0.29582 3.586117 1.243663
H  1.389035 -3.095124 1.282183
H  2.846117 0.694363 -1.310791
H  -2.095004 -1.625015 -0.101811
H  -3.827612 2.295836 -0.13633
H  3.509115 -3.565014 2.500384
H  3.787194 -3.542628 0.764044
H  4.266507 -2.156666 1.755942
H  2.422154 -0.641957 2.792398
H  1.666802 -2.061848 3.516356
H  0.725081 -1.01815 2.45514
H  1.634365 -1.212908 -2.798384
H  -4.33687 -2.612635 -0.142829
H  -6.067828 1.30177 -0.143801
H  -6.344564 -1.160435 -0.15655
H  2.218525 4.577014 0.41976
H  3.828836 3.844399 0.503819
H  2.619452 3.449077 1.738115
elementType: O N C H
totalener: -995.13859076 hartree
nucrepener: 1798.60461405 hartree
electener: -2793.74320481 hartree
oneelecener: -4927.04288884 hartree
twoeener: 2133.29968402 hartree
cpcmener: -0.02955224 hartree
kineticenergy: 990.78341085 hartree
xcener: -96.153917478371 hartree
chargesum: -0.0000000
charge: -0.300590 -0.345743 -0.513238 -0.119500 -0.131043 0.128289 -0.021030 -0.180844 0.104622 0.266519 -0.244870 -0.197555 0.148398 -0.216655 -0.210026 -0.257862 -0.255120 -0.165220 -0.167086 -0.153053 0.478651 -0.130807 0.132536 0.142492 0.139572 0.066359 0.156623 0.142413 0.143239 0.095732 0.094070 0.088400 0.089570 0.097732 0.093515 0.191771 0.154829 0.154165 0.156729 0.110927 0.121287 0.111805
qa: -0.3006 -0.3457 -0.5132 -0.1195 -0.1310 0.1283 -0.0210 -0.1808 0.1046 0.2665 -0.2449 -0.1976 0.1484 -0.2167 -0.2100 -0.2579 -0.2551 -0.1652 -0.1671 -0.1531 0.4787 -0.1308 0.1325 0.1425 0.1396 0.0664 0.1566 0.1424 0.1432 0.0957 0.0941 0.0884 0.0896 0.0977 0.0935 0.1918 0.1548 0.1542 0.1567 0.1109 0.1213 0.1118
va: 2.1083 2.0376 2.0025 3.0905 3.2119 3.5793 4.0950 3.9207 3.5196 3.8541 3.9884 3.8998 3.8187 3.9355 3.9428 3.9113 3.9285 3.9188 3.9195 3.8954 4.3787 3.8807 1.0256 1.0053 1.0095 1.0239 1.0373 1.0090 1.0069 1.0070 1.0167 1.0068 1.0057 1.0085 1.0070 1.0058 0.9942 0.9940 0.9907 0.9848 0.9937 0.9875
dispcorr: -0.019307787 hartree
energy: -995.157898546146
dipole: 5.79142 -5.08888 0.70254 -0.88483 2.36286 1.47804 13.15724 -11.99206 1.16518
magnitude: 2.00893 au
magnitude: 5.10629 debye
