program: Orca
programVersion: 5.0.2
elementType: O O O N N C C C C C C C C C C C C C C C C C H H H H H H H H H H H H H H H H H H H H
charge: 0
multiplicity: 1
keywords: wb97x-d3
keywords: def2-TZVPP
keywords: def2/J RIJCOSX
keywords: DEFGRID2
keywords: scfconv7
keywords: smallprint printgap noloewdin
keywords: NOSOSCF
formula: C17H20N2O3
InChI: InChI=1/C17H20N2O3/c1-12(2)22-17(20)19-18-15-11-14(9-10-16(15)21-3)13-7-5-4-6-8-13/h4-12,18-19H,1-3H3
42 atoms
O  2.150787 -1.909672 0.412953
O  2.288944 3.007192 -0.148503
O  1.824932 -2.956629 -1.55915
N  2.113276 0.430152 -0.73768
N  2.031056 -0.718615 -1.467804
C  -1.45413 1.220564 -0.076399
C  0.944342 1.127964 -0.451283
C  -0.299781 0.518039 -0.436704
C  -2.764022 0.538683 -0.057122
C  1.04261 2.489523 -0.10277
C  -1.337841 2.559957 0.267471
C  -0.097854 3.19089 0.247534
C  2.132366 -3.15204 1.151938
C  -3.683408 0.791514 0.962921
C  -3.115484 -0.375822 -1.052233
C  3.529091 -3.735547 1.203226
C  1.581798 -2.819752 2.521385
C  -4.915669 0.155474 0.984552
C  -4.347519 -1.012771 -1.030428
C  -5.253891 -0.749729 -0.012185
C  1.991944 -1.952228 -0.89824
C  2.466899 4.371422 0.17317
H  -0.383388 -0.531542 -0.688346
H  -2.214268 3.137856 0.53107
H  -0.04279 4.240517 0.504304
H  1.457367 -3.851645 0.654379
H  2.923404 0.986026 -0.964805
H  -3.426188 1.477968 1.760311
H  -2.428243 -0.578657 -1.864654
H  4.225132 -3.054288 1.695762
H  3.518073 -4.668901 1.767257
H  3.911545 -3.960444 0.207037
H  1.511703 -3.730072 3.117047
H  0.580933 -2.391514 2.453754
H  2.223316 -2.11773 3.056583
H  1.7489 -0.662258 -2.439696
H  -5.609718 0.361401 1.789532
H  -4.602221 -1.712153 -1.816667
H  -6.215109 -1.247143 0.005075
H  1.915403 5.027833 -0.505474
H  3.529947 4.577693 0.068454
H  2.167986 4.590494 1.201741
elementType: O N C H
totalener: -995.13846869 hartree
nucrepener: 1758.33159384 hartree
electener: -2753.47006253 hartree
oneelecener: -4846.63811002 hartree
twoeener: 2093.16804749 hartree
cpcmener: -0.03139240 hartree
kineticenergy: 990.78358506 hartree
xcener: -96.153308883903 hartree
chargesum: -0.0000000
charge: -0.297539 -0.346720 -0.520508 -0.103111 -0.152880 0.138254 0.023849 -0.211355 0.084737 0.247273 -0.255886 -0.190381 0.153672 -0.207003 -0.213261 -0.258168 -0.248829 -0.169820 -0.166345 -0.152395 0.483904 -0.133271 0.141800 0.142707 0.138609 0.064687 0.166536 0.144280 0.144474 0.088555 0.095350 0.094152 0.091442 0.094916 0.088301 0.188737 0.154677 0.155051 0.156972 0.111174 0.121460 0.111902
qa: -0.2975 -0.3467 -0.5205 -0.1031 -0.1529 0.1383 0.0238 -0.2114 0.0847 0.2473 -0.2559 -0.1904 0.1537 -0.2070 -0.2133 -0.2582 -0.2488 -0.1698 -0.1663 -0.1524 0.4839 -0.1333 0.1418 0.1427 0.1386 0.0647 0.1665 0.1443 0.1445 0.0886 0.0954 0.0942 0.0914 0.0949 0.0883 0.1887 0.1547 0.1551 0.1570 0.1112 0.1215 0.1119
va: 2.1232 2.0369 1.9959 3.0529 3.1764 3.5989 4.1194 3.9304 3.5350 3.9014 3.9946 3.8983 3.8136 3.9357 3.9368 3.9137 3.9302 3.9230 3.9181 3.8933 4.3991 3.8826 1.0179 1.0054 1.0099 1.0274 1.0259 1.0062 1.0060 1.0071 1.0068 1.0147 1.0062 1.0084 1.0071 1.0127 0.9940 0.9938 0.9907 0.9862 0.9936 0.9860
dispcorr: -0.017659310 hartree
energy: -995.156128002554
dipole: 4.61150 -4.14576 0.46574 -3.88832 5.57402 1.68570 9.86360 -9.22922 0.63438
magnitude: 1.86036 au
magnitude: 4.72865 debye
