program: Orca
programVersion: 5.0.2
elementType: O O O N N C C C C C C C C C C C C C C C C C H H H H H H H H H H H H H H H H H H H H
charge: 0
multiplicity: 1
keywords: wb97x-d3
keywords: def2-TZVPP
keywords: def2/J RIJCOSX
keywords: DEFGRID2
keywords: scfconv7
keywords: smallprint printgap noloewdin
keywords: NOSOSCF
formula: C17H20N2O3
InChI: InChI=1/C17H20N2O3/c1-12(2)22-17(20)19-18-15-11-14(9-10-16(15)21-3)13-7-5-4-6-8-13/h4-12,18-19H,1-3H3
42 atoms
O  2.128782 -1.968135 0.059955
O  2.349721 2.928176 -0.444026
O  1.75771 -2.594034 2.196782
N  2.100075 0.556223 0.714615
N  1.969945 -0.420705 1.656761
C  -1.43003 1.231535 -0.22818
C  0.954597 1.189247 0.238778
C  -0.302099 0.611613 0.31882
C  -2.751698 0.580502 -0.131147
C  1.093452 2.432192 -0.40937
C  -1.273174 2.455203 -0.863462
C  -0.019585 3.052776 -0.948645
C  2.040292 -3.326982 -0.423906
C  -3.655964 0.632321 -1.193968
C  -3.126865 -0.111573 1.022486
C  1.589946 -3.228271 -1.865617
C  3.377956 -4.022821 -0.276313
C  -4.892614 0.010045 -1.107558
C  -4.362099 -0.736271 1.108291
C  -5.250831 -0.679437 0.043241
C  1.941005 -1.74387 1.350196
C  2.559739 4.193344 -1.036651
H  -0.413324 -0.35233 0.798576
H  -2.12851 2.97341 -1.277668
H  0.066544 4.014406 -1.436887
H  1.280894 -3.859563 0.152991
H  2.903433 1.14606 0.867224
H  -3.382319 1.144485 -2.108415
H  -2.45444 -0.149141 1.870995
H  2.316079 -2.691551 -2.478968
H  1.475244 -4.228879 -2.282435
H  0.626651 -2.723153 -1.948891
H  3.692523 -4.087391 0.765512
H  4.156391 -3.508291 -0.842493
H  3.304293 -5.041335 -0.659396
H  1.694236 -0.166113 2.597969
H  -5.573882 0.05491 -1.947902
H  -4.632853 -1.264119 2.0140
H  -6.213902 -1.169153 0.109002
H  2.297263 4.196505 -2.09789
H  3.622238 4.407446 -0.941314
H  1.997596 4.981595 -0.528557
elementType: O N C H
totalener: -995.13844174 hartree
nucrepener: 1759.58269544 hartree
electener: -2754.72113718 hartree
oneelecener: -4849.14763833 hartree
twoeener: 2094.42650115 hartree
cpcmener: -0.03158867 hartree
kineticenergy: 990.77752854 hartree
xcener: -96.152722422003 hartree
chargesum: -0.0000000
charge: -0.298790 -0.346775 -0.520897 -0.105784 -0.153252 0.134517 0.026754 -0.211503 0.085146 0.249067 -0.253657 -0.192157 0.156611 -0.203498 -0.212511 -0.251850 -0.258772 -0.172291 -0.166965 -0.150547 0.486994 -0.133209 0.140930 0.141714 0.138518 0.063696 0.167142 0.143975 0.143954 0.088891 0.091212 0.095904 0.093623 0.088214 0.095282 0.189282 0.154617 0.155057 0.156967 0.111538 0.121368 0.111482
qa: -0.2988 -0.3468 -0.5209 -0.1058 -0.1533 0.1345 0.0268 -0.2115 0.0851 0.2491 -0.2537 -0.1922 0.1566 -0.2035 -0.2125 -0.2518 -0.2588 -0.1723 -0.1670 -0.1505 0.4870 -0.1332 0.1409 0.1417 0.1385 0.0637 0.1671 0.1440 0.1440 0.0889 0.0912 0.0959 0.0936 0.0882 0.0953 0.1893 0.1546 0.1551 0.1570 0.1115 0.1214 0.1115
va: 2.1212 2.0373 1.9955 3.0471 3.1770 3.6098 4.1091 3.9288 3.5393 3.9071 3.9958 3.8979 3.8137 3.9362 3.9358 3.9321 3.9077 3.9257 3.9182 3.8924 4.3948 3.8830 1.0188 1.0058 1.0099 1.0255 1.0244 1.0062 1.0060 1.0069 1.0065 1.0079 1.0170 1.0071 1.0068 1.0126 0.9941 0.9939 0.9908 0.9857 0.9937 0.9866
dispcorr: -0.017689575 hartree
energy: -995.156131314973
dipole: 4.51186 -4.05060 0.46126 -5.94760 7.47776 1.53016 -8.74781 7.81498 -0.93283
magnitude: 1.85049 au
magnitude: 4.70358 debye
