program: Orca
programVersion: 5.0.2
elementType: O O O N N C C C C C C C C C C C C C C C C C H H H H H H H H H H H H H H H H H H H H
charge: 0
multiplicity: 1
keywords: wb97x-d3
keywords: def2-TZVPP
keywords: def2/J RIJCOSX
keywords: DEFGRID2
keywords: scfconv7
keywords: smallprint printgap noloewdin
keywords: NOSOSCF
formula: C17H20N2O3
InChI: InChI=1/C17H20N2O3/c1-12(2)22-17(20)19-18-15-11-14(9-10-16(15)21-3)13-7-5-4-6-8-13/h4-12,18-19H,1-3H3
42 atoms
O  2.273741 -1.896427 0.293053
O  2.376845 3.009615 -0.231648
O  1.81949 -2.939833 -1.65589
N  2.19579 0.441491 -0.856968
N  2.088447 -0.706967 -1.584065
C  -1.347884 1.193466 -0.033508
C  1.033397 1.1273 -0.514995
C  -0.20462 0.507441 -0.455143
C  -2.645239 0.492128 0.045128
C  1.135789 2.483124 -0.14765
C  -1.227775 2.529752 0.321401
C  0.005694 3.170998 0.258684
C  2.080271 -3.104027 1.061606
C  -3.518759 0.728402 1.108753
C  -3.026172 -0.43173 -0.930522
C  2.90082 -2.939122 2.321669
C  0.603734 -3.291314 1.349907
C  -4.732806 0.063344 1.194158
C  -4.240029 -1.097455 -0.845176
C  -5.098711 -0.853817 0.218344
C  2.041267 -1.937484 -1.008687
C  2.555573 4.373565 0.090182
H  -0.290601 -0.539377 -0.717432
H  -2.096786 3.096376 0.630635
H  0.063152 4.217018 0.529422
H  2.461032 -3.955888 0.494069
H  2.985105 1.00766 -1.127191
H  -3.236884 1.422701 1.890942
H  -2.376027 -0.620518 -1.776241
H  2.561023 -2.089577 2.917068
H  2.808044 -3.834833 2.935921
H  3.958915 -2.801769 2.095142
H  0.456974 -4.181144 1.962998
H  0.021097 -3.426353 0.437851
H  0.197943 -2.437012 1.89527
H  1.777587 -0.64994 -2.547129
H  -5.390266 0.254824 2.032802
H  -4.517739 -1.805119 -1.61615
H  -6.044815 -1.375383 0.286426
H  2.29483 4.585423 1.130601
H  1.97259 5.028239 -0.563401
H  3.612035 4.590123 -0.054107
elementType: O N C H
totalener: -995.13828100 hartree
nucrepener: 1774.93512512 hartree
electener: -2770.07340612 hartree
oneelecener: -4879.82349767 hartree
twoeener: 2109.75009154 hartree
cpcmener: -0.03139441 hartree
kineticenergy: 990.77893241 hartree
xcener: -96.152542078599 hartree
chargesum: -0.0000000
charge: -0.297012 -0.346359 -0.513372 -0.103057 -0.149319 0.145084 0.033978 -0.220190 0.082316 0.243452 -0.258048 -0.188381 0.163048 -0.204445 -0.214485 -0.253301 -0.270284 -0.171105 -0.164622 -0.151797 0.465954 -0.133011 0.138507 0.142361 0.138753 0.066810 0.166395 0.144165 0.144424 0.089823 0.089507 0.096234 0.102631 0.095170 0.090462 0.188570 0.154696 0.155116 0.157183 0.111779 0.110850 0.121519
qa: -0.2970 -0.3464 -0.5134 -0.1031 -0.1493 0.1451 0.0340 -0.2202 0.0823 0.2435 -0.2580 -0.1884 0.1630 -0.2044 -0.2145 -0.2533 -0.2703 -0.1711 -0.1646 -0.1518 0.4660 -0.1330 0.1385 0.1424 0.1388 0.0668 0.1664 0.1442 0.1444 0.0898 0.0895 0.0962 0.1026 0.0952 0.0905 0.1886 0.1547 0.1551 0.1572 0.1118 0.1108 0.1215
va: 2.1153 2.0372 2.0014 3.0563 3.1769 3.5972 4.1055 3.9346 3.5329 3.9069 3.9994 3.8932 3.7968 3.9363 3.9338 3.9384 3.9048 3.9244 3.9171 3.8928 4.4197 3.8828 1.0162 1.0055 1.0098 1.0240 1.0252 1.0060 1.0056 1.0060 1.0058 1.0081 1.0092 1.0163 1.0061 1.0128 0.9941 0.9938 0.9907 0.9858 0.9865 0.9936
dispcorr: -0.018383901 hartree
energy: -995.156664905262
dipole: 1.23774 -0.88781 0.34993 -3.30835 5.02705 1.71870 10.15072 -9.51903 0.63169
magnitude: 1.86425 au
magnitude: 4.73854 debye
