program: Orca
programVersion: 5.0.2
elementType: O O O N N C C C C C C C C C C C C C C C C C H H H H H H H H H H H H H H H H H H H H
charge: 0
multiplicity: 1
keywords: wb97x-d3
keywords: def2-TZVPP
keywords: def2/J RIJCOSX
keywords: DEFGRID2
keywords: scfconv7
keywords: smallprint printgap noloewdin
keywords: NOSOSCF
formula: C17H20N2O3
InChI: InChI=1/C17H20N2O3/c1-12(2)22-17(20)19-18-15-11-14(9-10-16(15)21-3)13-7-5-4-6-8-13/h4-12,18-19H,1-3H3
42 atoms
O  2.271217 -1.932776 -0.188877
O  2.384535 2.967456 -0.360549
O  1.881395 -2.731815 1.884315
N  2.231466 0.525364 0.664296
N  2.153519 -0.523962 1.534133
C  -1.353102 1.193658 -0.043538
C  1.055425 1.161848 0.278518
C  -0.185147 0.555308 0.386227
C  -2.656204 0.509195 0.07326
C  1.138994 2.451158 -0.28415
C  -1.253423 2.467848 -0.583085
C  -0.015059 3.091535 -0.700937
C  2.077656 -3.229794 -0.795839
C  -3.805558 1.212488 0.438824
C  -2.771798 -0.859309 -0.180245
C  0.599248 -3.458526 -1.040315
C  2.885303 -3.220885 -2.074932
C  -5.02915 0.568833 0.548571
C  -3.994811 -1.503512 -0.069314
C  -5.12985 -0.792577 0.296089
C  2.08207 -1.815417 1.114103
C  2.542536 4.276315 -0.869817
H  -0.263632 -0.424144 0.839968
H  -2.134358 2.984781 -0.940873
H  0.029854 4.082441 -1.132953
H  2.468818 -3.999762 -0.127219
H  3.032959 1.115371 0.82767
H  -3.740917 2.27045 0.661565
H  -1.901595 -1.426679 -0.487986
H  0.45107 -4.428414 -1.516438
H  0.026833 -3.460714 -0.112407
H  0.18826 -2.694268 -1.702494
H  3.943161 -3.043601 -1.877777
H  2.529441 -2.458784 -2.770262
H  2.798569 -4.189509 -2.567226
H  1.864048 -0.346274 2.489147
H  -5.905325 1.132925 0.842045
H  -4.061121 -2.563866 -0.277637
H  -6.084417 -1.295257 0.383408
H  3.605793 4.500933 -0.819504
H  2.000239 5.015618 -0.27405
H  2.218467 4.351024 -1.911368
elementType: O N C H
totalener: -995.13837597 hartree
nucrepener: 1776.50604403 hartree
electener: -2771.64442000 hartree
oneelecener: -4882.86716388 hartree
twoeener: 2111.22274389 hartree
cpcmener: -0.03157302 hartree
kineticenergy: 990.78214851 hartree
xcener: -96.153500585401 hartree
chargesum: 0.0000000
charge: -0.298143 -0.346676 -0.513958 -0.106464 -0.149830 0.116812 0.034332 -0.210979 0.097971 0.242557 -0.251909 -0.193501 0.167391 -0.202808 -0.206987 -0.279591 -0.253000 -0.169588 -0.175431 -0.150144 0.470187 -0.133501 0.140866 0.142200 0.138775 0.067116 0.168311 0.142838 0.148644 0.106984 0.095989 0.089171 0.096589 0.089519 0.089778 0.187969 0.154804 0.151842 0.156478 0.121531 0.111698 0.112158
qa: -0.2981 -0.3467 -0.5140 -0.1065 -0.1498 0.1168 0.0343 -0.2110 0.0980 0.2426 -0.2519 -0.1935 0.1674 -0.2028 -0.2070 -0.2796 -0.2530 -0.1696 -0.1754 -0.1501 0.4702 -0.1335 0.1409 0.1422 0.1388 0.0671 0.1683 0.1428 0.1486 0.1070 0.0960 0.0892 0.0966 0.0895 0.0898 0.1880 0.1548 0.1518 0.1565 0.1215 0.1117 0.1122
va: 2.1164 2.0378 2.0015 3.0568 3.1768 3.6117 4.1059 3.9368 3.5109 3.9148 3.9969 3.8924 3.7864 3.9383 3.9317 3.9118 3.9369 3.9205 3.9298 3.8916 4.4146 3.8823 1.0206 1.0058 1.0099 1.0251 1.0235 1.0062 0.9988 1.0093 1.0147 1.0043 1.0079 1.0064 1.0058 1.0130 0.9939 0.9954 0.9908 0.9936 0.9866 0.9855
dispcorr: -0.018768997 hartree
energy: -995.157144964611
dipole: 1.04734 -0.70001 0.34733 -4.55597 6.17840 1.62243 -9.76206 8.90927 -0.85279
magnitude: 1.86552 au
magnitude: 4.74176 debye
