program: Orca
programVersion: 5.0.2
elementType: O O O N N C C C C C C C C C C C C C C C C C H H H H H H H H H H H H H H H H H H H H
charge: 0
multiplicity: 1
keywords: wb97x-d3
keywords: def2-TZVPP
keywords: def2/J RIJCOSX
keywords: DEFGRID2
keywords: scfconv7
keywords: smallprint printgap noloewdin
keywords: NOSOSCF
formula: C17H20N2O3
InChI: InChI=1/C17H20N2O3/c1-12(2)22-17(20)19-18-15-11-14(9-10-16(15)21-3)13-7-5-4-6-8-13/h4-12,18-19H,1-3H3
42 atoms
O  2.079752 -2.735394 -0.264628
O  2.328583 3.079447 -0.583706
O  2.445489 -0.844266 0.919129
N  2.039096 0.566317 -1.388057
N  2.072395 -0.797285 -1.317203
C  -1.370846 1.268431 -0.086225
C  0.947604 1.217407 -0.808211
C  -0.282567 0.599984 -0.654518
C  -2.669803 0.582643 0.068295
C  1.098607 2.554179 -0.396992
C  -1.200774 2.583743 0.32386
C  0.025006 3.222367 0.167384
C  2.139303 -3.570636 0.913923
C  -3.439562 0.761483 1.219472
C  -3.16263 -0.257662 -0.932224
C  0.798365 -3.565558 1.62047
C  2.538345 -4.948733 0.434672
C  -4.662609 0.123645 1.364312
C  -4.386108 -0.895172 -0.788081
C  -5.142488 -0.706999 0.360789
C  2.212343 -1.423347 -0.118684
C  2.58835 4.379926 -0.09615
H  -0.396536 -0.433996 -0.956486
H  -2.027352 3.136651 0.751481
H  0.122587 4.249665 0.492782
H  2.913041 -3.185305 1.581788
H  2.937455 0.989551 -1.204985
H  -3.070151 1.389772 2.020799
H  -2.594686 -0.399018 -1.843864
H  0.51135 -2.567522 1.952377
H  0.009185 -3.955099 0.974726
H  0.849046 -4.20056 2.505941
H  1.791272 -5.375372 -0.237111
H  2.636005 -5.616909 1.290639
H  3.499308 -4.931192 -0.08086
H  1.808289 -1.312151 -2.14385
H  -5.239409 0.270641 2.268739
H  -4.752931 -1.534678 -1.581098
H  -6.097497 -1.204131 0.473319
H  3.635493 4.586139 -0.307361
H  2.428197 4.450766 0.983134
H  1.976335 5.134559 -0.597387
elementType: O N C H
totalener: -995.13992807 hartree
nucrepener: 1763.18388529 hartree
electener: -2758.32381336 hartree
oneelecener: -4856.84674774 hartree
twoeener: 2098.52293438 hartree
cpcmener: -0.03086398 hartree
kineticenergy: 990.78302645 hartree
xcener: -96.152724847788 hartree
chargesum: -0.0000000
charge: -0.321625 -0.344550 -0.505922 -0.132922 -0.123724 0.140969 -0.019990 -0.181884 0.092177 0.261739 -0.251470 -0.194663 0.162204 -0.201713 -0.211382 -0.258564 -0.253249 -0.173328 -0.170089 -0.150460 0.478948 -0.131584 0.129511 0.142187 0.139577 0.067135 0.164427 0.145553 0.144686 0.093707 0.088571 0.097169 0.088480 0.091499 0.096606 0.191507 0.154234 0.155133 0.157001 0.121120 0.112258 0.110718
qa: -0.3216 -0.3445 -0.5059 -0.1329 -0.1237 0.1410 -0.0200 -0.1819 0.0922 0.2617 -0.2515 -0.1947 0.1622 -0.2017 -0.2114 -0.2586 -0.2532 -0.1733 -0.1701 -0.1505 0.4789 -0.1316 0.1295 0.1422 0.1396 0.0671 0.1644 0.1456 0.1447 0.0937 0.0886 0.0972 0.0885 0.0915 0.0966 0.1915 0.1542 0.1551 0.1570 0.1211 0.1123 0.1107
va: 2.0945 2.0420 2.0078 3.1024 3.2064 3.5786 4.0923 3.9188 3.5261 3.8820 3.9919 3.9018 3.8162 3.9336 3.9388 3.9010 3.9380 3.9242 3.9175 3.8903 4.3845 3.8813 1.0283 1.0058 1.0093 1.0223 1.0305 1.0051 1.0046 1.0186 1.0074 1.0072 1.0067 1.0055 1.0078 1.0081 0.9942 0.9937 0.9907 0.9937 0.9875 0.9848
dispcorr: -0.017821492 hartree
energy: -995.157749565475
dipole: 0.97969 -0.79895 0.18073 -9.94861 9.64661 -0.30200 5.88868 -6.27349 -0.38482
magnitude: 0.52149 au
magnitude: 1.32552 debye
