program: Orca
programVersion: 5.0.2
elementType: O O O N N C C C C C C C C C C C C C C C C C H H H H H H H H H H H H H H H H H H H H
charge: 0
multiplicity: 1
keywords: wb97x-d3
keywords: def2-TZVPP
keywords: def2/J RIJCOSX
keywords: DEFGRID2
keywords: scfconv7
keywords: smallprint printgap noloewdin
keywords: NOSOSCF
formula: C17H20N2O3
InChI: InChI=1/C17H20N2O3/c1-12(2)22-17(20)19-18-15-11-14(9-10-16(15)21-3)13-7-5-4-6-8-13/h4-12,18-19H,1-3H3
42 atoms
O  2.130052 -1.445788 0.066195
O  2.469519 2.529504 -0.146935
O  1.665754 -2.863554 1.765275
N  1.874447 0.647367 1.614191
N  1.804611 -0.628118 2.098998
C  -1.386554 1.005082 -0.134204
C  0.877102 1.077828 0.737771
C  -0.405126 0.558369 0.753471
C  -2.742529 0.424887 -0.099253
C  1.191738 2.083986 -0.190759
C  -1.056152 1.997126 -1.045236
C  0.225225 2.534057 -1.071801
C  1.991211 -2.461835 -0.938993
C  -3.425674 0.134047 -1.27984
C  -3.374732 0.149552 1.112827
C  1.584889 -1.737137 -2.207056
C  3.28933 -3.231679 -1.086121
C  -4.698169 -0.413545 -1.250226
C  -4.645999 -0.4007 1.144209
C  -5.314243 -0.684739 -0.037541
C  1.852918 -1.757824 1.326571
C  2.888714 3.461828 -1.108077
H  -0.644128 -0.237505 1.447448
H  -1.803949 2.382332 -1.725678
H  0.450938 3.310644 -1.790012
H  1.195497 -3.148272 -0.638801
H  2.806397 0.916573 1.339684
H  -2.943912 0.315022 -2.232656
H  -2.874347 0.391415 2.042226
H  2.361668 -1.044416 -2.534666
H  1.416908 -2.456237 -3.008879
H  0.66447 -1.171624 -2.058896
H  4.110629 -2.566913 -1.358473
H  3.19092 -3.980486 -1.872705
H  3.549012 -3.750389 -0.164567
H  1.576699 -0.744255 3.0720
H  -5.206314 -0.639011 -2.178802
H  -5.119659 -0.60039 2.096539
H  -6.306645 -1.114884 -0.013515
H  3.943776 3.650046 -0.922286
H  2.347454 4.409385 -1.026491
H  2.775609 3.080553 -2.127879
totalener: -995.11530458 hartree
nucrepener: 1805.31795088 hartree
electener: -2800.43325547 hartree
oneelecener: -4939.64437025 hartree
twoeener: 2139.21111478 hartree
kineticenergy: 990.84406651 hartree
xcener: -96.159934338782 hartree
chargesum: 0.0000000
charge: -0.290288 -0.325581 -0.399233 -0.103914 -0.163075 0.126417 0.032955 -0.206064 0.133816 0.264848 -0.219943 -0.161471 0.133335 -0.194104 -0.197489 -0.228993 -0.249825 -0.140842 -0.132028 -0.115805 0.422104 -0.142429 0.118745 0.117865 0.106627 0.063963 0.137155 0.119857 0.121354 0.076822 0.086316 0.093294 0.078006 0.080592 0.104493 0.170369 0.121640 0.122453 0.123744 0.112620 0.101094 0.100600
qa: -0.2903 -0.3256 -0.3992 -0.1039 -0.1631 0.1264 0.0330 -0.2061 0.1338 0.2648 -0.2199 -0.1615 0.1333 -0.1941 -0.1975 -0.2290 -0.2498 -0.1408 -0.1320 -0.1158 0.4221 -0.1424 0.1187 0.1179 0.1066 0.0640 0.1372 0.1199 0.1214 0.0768 0.0863 0.0933 0.0780 0.0806 0.1045 0.1704 0.1216 0.1225 0.1237 0.1126 0.1011 0.1006
va: 2.1043 2.0530 2.1217 3.0988 3.1788 3.6453 4.0987 3.9588 3.5511 3.8693 4.0555 3.9325 3.8594 3.9870 3.9963 3.9232 3.9119 3.9855 3.9719 3.9552 4.4109 3.9155 1.0311 1.0127 1.0174 1.0249 1.0525 1.0118 1.0114 1.0091 1.0114 1.0091 1.0088 1.0102 1.0174 1.0207 1.0034 1.0031 1.0002 0.9980 0.9852 0.9873
dispcorr: -0.019627783 hartree
energy: -995.134932367122
dipole: 5.30299 -4.79011 0.51287 -2.94410 3.88150 0.93740 -12.80722 11.84118 -0.96604
magnitude: 1.44048 au
magnitude: 3.66141 debye
